program: Gaussian 09
title: ts
version: EM64L-G09RevD.01
method: RwB97XD
basis: 6-31+G(d,p)
operation: Freq
keyword: #P
keyword: Geom=AllCheck
keyword: Guess=TCheck
keyword: SCRF=Check
keyword: GenChk
keyword: RwB97XD/6-31+G(d,p)
keyword: Freq
converged: YES YES YES YES
title: Mulliken charges:
elementType: C N O H H O H H C H H H H
charge: 0.251739 0.005883 -0.773376 0.483478 0.409347 -0.787193 0.403819 0.406835 -0.499292 0.260717 0.260566 0.280992 0.296484
chargesum: 1.00000
title: Mulliken charges with hydrogens summed into heavy atoms:
elementType: C N O O C
charge: 0.548223 0.005883 0.119449 0.023461 0.302983
polarizability: 5.83607404e+01 8.63970988e+00 3.74295384e+01 -2.36594291e+00 7.33344170e-01 4.35234156e+01
1716.lowfreq: -784.1046 -35.1827 -0.0005 0.0004 0.0012 1.3712 5.5139 36.4374 51.1426
frequency: -784.1016 36.1031 49.1971 99.0671 125.1424 134.0482 246.3639 283.5703 315.8687 366.0253 386.9046 436.8038 513.3380 577.2330 605.9225 901.7382 919.3701 1057.1247 1071.3536 1392.4445 1441.5587 1460.0747 1640.7224 1671.6677 2131.0397 2462.7246 3080.9285 3190.0988 3193.6885 3462.8219 3890.1356 3930.0936 4001.8462
redmass: 2.0026 4.2381 3.0451 1.1737 1.6102 1.5690 4.0046 1.2323 1.0988 4.0880 3.0099 1.2367 1.0818 1.6789 1.1509 2.9155 1.1793 1.4740 1.4372 1.2094 1.0391 1.0364 1.0842 1.0770 10.3303 1.0673 1.0314 1.1057 1.1052 1.0632 1.0444 1.0683 1.0839
irintensity: 534.2689 5.0019 2.6451 0.6013 18.8673 9.7713 21.4286 290.5681 47.4896 31.0263 6.3158 60.7531 119.5142 8.1856 32.4724 22.2858 116.6899 2.6862 17.0417 18.3905 24.7121 29.3431 147.2284 24.3584 104.9360 85.1632 23.3222 18.1616 14.6388 1325.5263 43.0788 145.8246 143.9648
temp: 298.150 k
press: 1.00000 atm
elementType: 6 7 8 1 1 8 1 1 6 1 1 1 1
symmnumber: 1
zpe: 269608.5 jmol-1
zpe.correction: 0.102688 hartree
zpe.thermalcorrener: 0.112323 hartree
zpe.thermalcorrenthalpy: 0.113267 hartree
zpe.thermalcorrgfe: 0.067853 hartree
zpe.sumelectzpe: -285.695537 hartree
zpe.sumelectthermal: -285.685903 hartree
zpe.sumelectthermalent: -285.684959 hartree
zpe.sumelectthermalfe: -285.730373 hartree
dipole: -2.4738 -1.1152 0.0665
dipole: 2.7143
quadrupole: 8.6933 -24.6932 -23.2242
quadrupole: 1.6733 -1.9738 -0.3571
quadrupole: 21.7680 -11.6185 -10.1495 1.6733 -1.9738 -0.3571
hfenergy: -285.7982258 hartree
pointgroup: C01 [X(C2H8N1O2)]
dipole: -1.0081057 -0.4455554 -0.0156844 debye
dipolederiv: -0.5348871 -0.3682248 -0.235843 -0.4408485 -0.0416403 -0.0120513 -0.4232637 -0.0924805 0.7655783 1.5410249 0.7788279 0.2241201 0.8394418 0.3468004 0.0642589 0.0921874 -0.0082424 -0.3289382 -1.2761611 -0.0713791 -0.1052522 -0.0775855 -0.7122039 -0.0704186 -0.2603617 -0.1592799 -0.5336559 0.9192753 -0.2513032 0.0301813 -0.5378929 0.4008111 -0.034824 -0.0168205 -0.0257071 0.2813279 0.2457777 -0.0552581 -0.0001734 0.056061 0.3636588 0.0342065 -0.0732946 0.000944 0.3042843 -0.7596805 0.0269504 -0.0015195 0.1503851 -0.7217715 0.0327324 0.0022348 0.0288809 -0.5473572 0.274455 0.0455487 0.0114555 0.0359349 0.3701901 -0.0073693 -0.0048491 -0.0062904 0.3258012 0.2737921 0.0403971 -0.0186881 0.0299922 0.3674348 -0.0115474 0.0042932 -0.0141661 0.3383086 0.0849155 0.0277398 0.0022216 0.0579039 0.037679 -0.0303541 0.1324327 0.0318279 -0.1575454 0.1539707 0.0197329 -0.031246 0.0121641 0.1408284 0.0212486 -0.0318012 0.0332623 0.0915352 0.1579251 0.016986 0.0042629 0.0269235 0.1061795 -0.0391269 0.0130932 -0.0463021 0.1175371 0.0507292 -0.0415102 0.0535879 -0.0404984 0.1345464 0.0263613 0.0740437 0.0352932 0.1308614 -0.1311368 -0.1685075 0.0668928 -0.1119813 0.2074872 0.0268839 0.4921059 0.2222602 0.2122629 unknown
polarizability: 58.3607404|8.6397099|37.4295384|-2.3659429|0.7333442|43.5234156 unknown
InChI: InChI=1/2C.N.2O.8H
charge 1 multiplicity 1
13 atoms
C  -1.60941627 -0.23537834 -0.22235442
N  -0.83436701 0.00533686 -1.1070955
O  0.70551116 1.00368879 0.05396231
H  1.53825621 0.47684178 0.01410251
H  0.90909406 1.87009228 -0.31522558
O  2.92259672 -0.523506 0.01952674
H  3.42058413 -0.79731183 -0.7564626
H  3.53207864 -0.54811427 0.76341674
C  -2.19114507 -0.29365097 1.11905619
H  -3.15252047 0.22492644 1.12727596
H  -2.32657502 -1.33597 1.41650609
H  -1.47576704 0.20778314 1.77759827
H  -2.03294676 -0.64835917 -1.29338725
