program: Gaussian 09
title: 000052692
version: EM64L-G09RevD.01
frameworkgroup: C1[X(C13H19NO)]
method: RPBEPBE
basis: SDD
operation: Freq
keyword: #p
keyword: freq=noraman
keyword: PBEPBE/SDD
title: #p freq=noraman PBEPBE/SDD
converged: YES YES NO NO
title: Mulliken charges:
elementType: O N C C C C C C C C C C C C C H H H H H H H H H H H H H H H H H H H
charge: -0.267610 0.001290 0.345391 0.233059 -0.214092 -0.529257 -0.479943 -0.536707 0.015829 -0.770524 -0.787069 -0.809248 -0.336525 0.179777 -0.454017 0.244170 0.233997 0.238082 0.231486 0.213274 0.238681 0.264664 0.213843 0.241794 0.214771 0.215575 0.234515 0.216107 0.226898 0.231081 0.208730 0.234208 0.233237 0.274532
chargesum: 0.00000
title: Mulliken charges with hydrogens summed into heavy atoms:
elementType: O N C C C C C C C C C C C C C
charge: -0.267610 0.001290 0.345391 0.233059 0.030079 -0.057178 -0.035183 -0.033362 0.015829 -0.100115 -0.120873 -0.142539 0.130920 0.179777 -0.179484
polarizability: 2.02990442e+02 -8.08314962e+00 1.27702067e+02 4.09137837e+00 -3.03948977e+00 1.15653722e+02
1716.lowfreq: -21.6532 -10.1332 -0.0007 -0.0007 -0.0006 10.0048 25.2603 47.6438 64.0837
frequency: 21.5468 47.0352 63.9709 112.7675 138.6247 154.9483 179.0047 198.9240 209.7414 232.1111 239.3008 248.1510 266.6170 310.1533 313.7170 324.3638 375.8765 379.8425 424.7838 444.9418 488.0773 544.0236 548.5514 575.8017 603.2368 626.2083 656.2586 676.6937 717.3649 770.7359 812.1843 835.7312 856.9460 866.2628 911.9247 929.5267 940.2327 943.9592 948.5234 959.2459 982.3021 989.1305 990.8024 1014.2706 1031.4630 1069.7526 1089.4109 1104.3467 1126.7300 1158.0875 1166.9231 1178.9918 1193.6594 1197.9170 1219.5583 1237.2069 1247.4789 1268.8070 1290.0921 1301.3372 1316.7919 1339.4429 1382.6368 1390.5601 1400.9745 1449.5992 1457.8782 1463.8880 1466.8107 1467.2837 1473.2151 1481.9871 1486.8874 1489.0308 1500.2570 1623.8461 2151.4463 2975.5538 2977.6181 2979.6430 2983.3004 3000.6610 3008.7779 3013.6527 3030.2549 3053.7330 3056.3725 3058.1274 3060.6737 3064.4194 3074.7598 3077.6344 3080.2975 3083.1336 3090.4044 3427.6826
redmass: 3.8458 2.7328 4.3099 4.3357 1.1600 3.3056 1.1981 1.4881 1.3281 2.7414 2.7611 2.8952 3.1549 2.7291 3.6459 3.2003 3.2058 2.5344 2.1851 3.0003 3.5530 4.0072 4.0526 3.7354 3.6817 1.2312 3.4516 1.2569 3.1883 2.5444 2.7698 2.1204 2.3855 3.1766 2.3132 1.6166 1.9193 3.3293 1.4906 2.5181 4.4492 1.6295 1.4470 1.4216 2.0514 1.4092 1.3221 2.5127 1.9774 2.4272 1.7830 1.0628 1.8801 1.7703 1.6276 2.3519 1.6637 2.0561 1.5361 1.6886 2.9116 1.3202 1.2042 1.2373 1.1987 1.0745 1.0631 1.0783 1.0504 1.0564 1.0544 1.0614 1.0633 1.0707 1.0651 11.7122 6.0218 1.0367 1.0552 1.0371 1.0363 1.0598 1.0610 1.0630 1.1054 1.1017 1.0960 1.0990 1.0973 1.0972 1.1006 1.1021 1.0984 1.0983 1.0974 1.1600
irintensity: 0.0240 1.2587 0.6056 7.7977 0.0999 0.7351 0.0042 0.2506 0.1093 0.3254 0.2298 0.1535 0.6706 1.7074 6.7149 4.4060 4.3673 0.0607 0.9222 1.5058 2.5079 0.2722 1.3724 3.6715 3.6587 76.3735 0.9535 59.7233 1.5195 4.4746 127.7276 13.4918 18.0128 49.5242 1.4631 2.2836 5.2825 31.9804 1.8609 18.7785 135.9880 1.1411 1.1746 3.2244 1.0823 6.9926 1.8973 10.7167 6.8032 1.4463 5.2822 0.3748 3.2021 3.1394 2.9275 0.0449 0.4856 3.4837 0.8309 3.3208 3.1372 49.8397 12.9152 16.6247 28.0275 12.5444 6.2932 12.9216 4.4741 22.8706 5.3504 1.3072 0.6873 17.5456 5.1080 5.2208 0.4788 20.8476 51.6378 33.0392 40.5549 33.2172 5.2015 54.3267 20.5387 8.5457 17.8851 6.1384 7.3673 78.7076 11.0627 59.8790 24.3250 61.6376 29.6666 64.2055
temp: 298.150 k
press: 1.00000 atm
elementType: 8 7 6 6 6 6 6 6 6 6 6 6 6 6 6 1 1 1 1 1 1 1 1 1 1 1 1 1 1 1 1 1 1 1
symmnumber: 1
zpe: 754816.2 jmol-1
zpe.correction: 0.287494 hartree
zpe.thermalcorrener: 0.303613 hartree
zpe.thermalcorrenthalpy: 0.304557 hartree
zpe.thermalcorrgfe: 0.244181 hartree
zpe.sumelectzpe: -635.474480 hartree
zpe.sumelectthermal: -635.458361 hartree
zpe.sumelectthermalent: -635.457417 hartree
zpe.sumelectthermalfe: -635.517793 hartree
dipole: -1.6739 -0.2780 0.0311
dipole: 1.6971
quadrupole: -83.8425 -89.5941 -90.4735
quadrupole: -0.0848 0.2257 -0.4414
quadrupole: 4.1275 -1.6240 -2.5035 -0.0848 0.2257 -0.4414
hfenergy: -635.7619742 hartree
pointgroup: C01 [X(C13H19N1O1)]
dipole: -0.6565146 -0.1216434 0.0047302 debye
polarizability: 203.2892618|-7.1039291|127.880274|3.0274102|-1.8068689|115.1766948 unknown
InChI: InChI=1S/C13H19NO/c1-5-8-15-14-11-9-10-6-7-13(11,4)12(10,2)3/h1,10H,6-9H2,2-4H3
charge 0 multiplicity 1
34 atoms
O  2.243734 -0.034295 0.018628
N  1.053088 0.834418 -0.223033
C  -2.261673 -0.156704 0.703747
C  -1.428838 0.7094 -0.34212
C  -1.736645 -1.528631 0.132613
C  -1.888272 0.077135 -1.711452
C  -2.113051 -1.441304 -1.378853
C  -0.191757 -1.363898 0.220111
C  -0.032072 0.116926 -0.11554
C  -1.861566 0.10864 2.175973
C  -3.793282 0.024436 0.592391
C  -1.534792 2.231978 -0.272774
C  3.42607 0.855314 -0.10343
C  4.636991 0.050425 0.091182
C  5.674988 -0.594865 0.248443
H  -2.120921 -2.426469 0.645075
H  -1.127505 0.236648 -2.494972
H  -2.81864 0.567232 -2.051703
H  -3.159974 -1.744609 -1.554722
H  -1.474556 -2.103579 -1.989877
H  0.363906 -2.00632 -0.486716
H  0.216363 -1.577298 1.224946
H  -2.292424 -0.666062 2.838078
H  -0.769661 0.122891 2.33404
H  -2.254383 1.086478 2.511508
H  -4.085705 1.048451 0.891181
H  -4.185267 -0.153307 -0.422344
H  -4.306417 -0.677358 1.276973
H  -1.184222 2.616506 0.701609
H  -0.911962 2.705109 -1.052468
H  -2.580676 2.557143 -0.423117
H  3.425958 1.326878 -1.105208
H  3.361486 1.657126 0.657612
H  6.577077 -1.162934 0.385418
