program: Gaussian 09
title: opt freq
version: EM64L-G09RevD.01
method: RwB97XD
basis: 6-31+G(d,p)
operation: Freq
keyword: #P
keyword: Geom=AllCheck
keyword: Guess=TCheck
keyword: SCRF=Check
keyword: GenChk
keyword: RwB97XD/6-31+G(d,p)
keyword: Freq
converged: YES YES YES YES
title: Mulliken charges:
elementType: C N H O H H O H H H
charge: 0.143693 0.046822 0.361925 -0.780024 0.478415 0.406269 -0.788118 0.404877 0.406411 0.319728
chargesum: 1.00000
title: Mulliken charges with hydrogens summed into heavy atoms:
elementType: C N O O
charge: 0.825347 0.046822 0.104661 0.023171
polarizability: 4.45783901e+01 4.99676841e+00 2.97284645e+01 7.13816998e+00 -3.96150496e-01 2.85637378e+01
1716.lowfreq: -835.8497 -11.8293 -2.8991 -0.0016 -0.0013 0.0007 11.0401 48.5970 79.8187
frequency: -835.8497 48.5754 79.6853 144.8537 181.1520 252.3846 291.1867 322.5724 384.6586 415.1680 450.2823 561.9579 791.6550 902.0723 970.2050 1643.9091 1677.0283 2064.2039 2416.0304 3302.5983 3468.8084 3889.6842 3929.2330 4000.9866
redmass: 1.6452 5.1994 3.3412 1.0384 2.9228 3.3331 1.2263 1.0914 3.9501 1.1667 1.0978 1.1097 1.3449 1.0604 1.1601 1.0847 1.0770 5.2929 1.0497 1.1734 1.0633 1.0445 1.0682 1.0838
irintensity: 463.5397 12.8039 16.8801 29.2033 61.8973 7.3186 296.8429 59.7718 7.2480 53.7305 165.5912 31.4735 60.5965 160.0214 26.6524 142.4168 24.4040 108.4388 125.8400 216.3746 1268.4516 42.0396 146.8898 145.9292
temp: 298.150 k
press: 1.00000 atm
elementType: 6 7 1 8 1 1 8 1 1 1
symmnumber: 1
zpe: 192532.3 jmol-1
zpe.correction: 0.073332 hartree
zpe.thermalcorrener: 0.081573 hartree
zpe.thermalcorrenthalpy: 0.082517 hartree
zpe.thermalcorrgfe: 0.041449 hartree
zpe.sumelectzpe: -246.382094 hartree
zpe.sumelectthermal: -246.373853 hartree
zpe.sumelectthermalent: -246.372908 hartree
zpe.sumelectthermalfe: -246.413977 hartree
dipole: -4.0373 -1.9524 -0.7281
dipole: 4.5433
quadrupole: 14.2328 -16.9038 -19.4183
quadrupole: 7.5707 0.8884 0.3904
quadrupole: 21.5960 -9.5407 -12.0552 7.5707 0.8884 0.3904
hfenergy: -246.4554258 hartree
pointgroup: C01[X(C1H6N1O2)]
dipole: -1.7029093 -0.6893092 -0.3645984 debye
dipolederiv: -0.4782377 -0.3188142 -0.2758009 -0.4474546 0.0321468 -0.1757611 -0.2596448 -0.1176657 0.1346328 1.3135933 0.4794084 0.5719695 0.870334 0.2491635 0.3937794 0.4656847 0.184089 0.1576702 0.3675702 0.0737251 -0.0008048 0.0473959 0.4483807 -0.0505139 0.0204122 -0.0263735 0.3219158 -1.2805352 -0.0493323 -0.0625665 -0.0025668 -0.5376749 0.0195438 -0.0868495 -0.0240142 -0.760482 0.9156092 -0.0291133 -0.2476066 -0.0714925 0.3008704 0.019378 -0.5054182 -0.018895 0.3931404 0.2351381 -0.0412218 -0.0614372 0.073378 0.3316786 0.0026633 0.0253801 -0.0185731 0.365271 -0.7495404 -0.0091823 0.0383849 0.022243 -0.585473 -0.0680702 0.1458224 -0.0546273 -0.7009538 0.271919 -0.0101343 0.0459045 0.0055095 0.3380881 0.0219121 0.030305 0.0217342 0.3658249 0.2675484 0.0211067 0.0295402 -0.0047261 0.3542499 0.0241226 0.0276096 0.0202457 0.3604959 0.136935 -0.1164422 -0.0375832 -0.4926204 0.0685699 -0.187054 0.1366986 0.0340798 0.362485 unknown
polarizability: 44.5783901|4.9967684|29.7284645|7.13817|-0.3961505|28.5637378 unknown
InChI: InChI=1/C.N.2O.6H
charge 1 multiplicity 1
10 atoms
C  -1.98103017 -0.6970877 -0.08028226
N  -1.55192218 0.38291374 -0.3272969
H  -2.14720511 -1.69944759 0.30646042
O  0.24895832 0.13267657 0.97062543
H  1.09772526 0.11001493 0.46926748
H  0.37717155 0.75169085 1.6977057
O  2.51150943 -0.02526902 -0.48467327
H  2.92550586 0.69602763 -0.96799876
H  3.20538518 -0.66276137 -0.29049234
H  -2.6720875 -0.0123634 -0.88232912
