program: Gaussian 09
title: opt freq calcfc
version: EM64L-G09RevD.01
method: RwB97XD
basis: 6-31+G(d,p)
operation: Freq
keyword: #P
keyword: Geom=AllCheck
keyword: Guess=TCheck
keyword: SCRF=Check
keyword: GenChk
keyword: RwB97XD/6-31+G(d,p)
keyword: Freq
converged: YES YES YES YES
title: Mulliken charges:
elementType: C N O H H C H H O H H C C C C H C H H H N O C H H H
charge: -0.216637 -0.157581 -0.334305 0.557590 0.455263 0.030754 0.175596 0.183122 -0.691869 0.452909 0.423215 -0.671366 0.222178 0.471611 -0.301065 0.195057 -0.315154 0.224667 0.192237 0.195674 -0.103356 -0.305952 -0.183201 0.160051 0.182430 0.158135
chargesum: 1.00000
title: Mulliken charges with hydrogens summed into heavy atoms:
elementType: C N O C O C C C C C N O C
charge: -0.216637 -0.157581 0.678548 0.389471 0.184255 -0.671366 0.417234 0.696277 -0.108828 -0.119480 -0.103356 -0.305952 0.317415
polarizability: 1.03425308e+02 7.15968115e+00 1.30851975e+02 1.14426892e+01 -5.71203522e-01 1.16069563e+02
1716.lowfreq: -22.9294 -9.2224 -0.0012 -0.0012 -0.0011 9.6635 19.1344 42.2677 45.1893
frequency: 11.3886 40.7672 45.0165 81.3951 96.0150 114.3710 140.6037 154.6545 197.6969 207.1454 260.6911 306.2160 327.5239 350.0113 383.7132 387.6010 459.5849 491.8011 512.5676 533.1288 624.4737 674.0293 694.9372 748.2175 756.7852 773.0425 821.8244 865.8830 920.8459 1014.1037 1015.3781 1020.3509 1028.4872 1041.5990 1093.9980 1114.6496 1126.4961 1162.1784 1181.3777 1183.7386 1230.1322 1243.2558 1260.0969 1263.9772 1288.3615 1325.6674 1369.7848 1424.6030 1438.5504 1460.1005 1487.3695 1499.3028 1504.2093 1521.8115 1543.4246 1636.3400 1665.2295 1707.3414 1751.6356 1798.5016 3007.0517 3040.6176 3079.1157 3115.8355 3198.9797 3222.3044 3226.0759 3244.0540 3262.6719 3771.9916 3818.5765 3917.1017
redmass: 2.8612 2.3867 3.2015 3.9333 4.3500 3.1839 1.2641 4.3935 1.6358 3.8016 4.4525 3.3636 3.3163 2.6830 3.0136 2.6877 4.1054 1.7673 1.3298 2.9768 2.5714 3.9736 2.0645 4.1602 5.6789 3.5983 4.3548 1.4812 1.2374 4.0965 1.3703 5.8538 1.7526 1.4584 2.6384 1.6375 1.5470 1.3642 1.4405 1.9753 1.3313 2.1945 1.1407 1.2547 9.0143 3.2159 1.3428 1.4682 1.2139 1.9159 1.1265 1.0560 1.0617 1.0944 2.1712 7.8633 5.2792 1.1186 6.9533 1.0613 1.0614 1.0346 1.1004 1.1070 1.1013 1.0911 1.0914 1.0967 1.0950 1.0495 1.0674 1.0799
irintensity: 1.0509 16.6462 0.9716 1.3379 4.6058 4.7167 41.6937 2.2252 2.9342 4.6827 6.7999 2.6924 84.3674 77.4606 61.0186 0.1086 58.4025 265.0306 1.6283 14.0552 85.8095 16.5954 18.6302 16.4316 19.3660 12.6217 73.0185 74.7439 0.4590 69.0251 6.1604 2.3580 33.2220 1.1094 55.5834 19.0349 10.6523 81.8542 64.3683 142.0428 514.7439 155.8896 13.8483 4.3280 9.8719 64.7236 2.3448 34.4233 799.0606 30.8828 2.8793 10.8388 12.0888 9.8884 6.9680 33.6941 20.1972 906.9716 27.1928 134.2711 17.8986 46.4655 14.3571 24.9769 7.3277 5.8021 1.0794 0.4709 5.9773 125.7758 294.2163 308.4888
temp: 298.150 k
press: 1.00000 atm
elementType: 6 7 8 1 1 6 1 1 8 1 1 6 6 6 6 1 6 1 1 1 7 8 6 1 1 1
symmnumber: 1
zpe: 557988.3 jmol-1
zpe.correction: 0.212527 hartree
zpe.thermalcorrener: 0.227063 hartree
zpe.thermalcorrenthalpy: 0.228007 hartree
zpe.thermalcorrgfe: 0.168722 hartree
zpe.sumelectzpe: -647.125274 hartree
zpe.sumelectthermal: -647.110738 hartree
zpe.sumelectthermalent: -647.109793 hartree
zpe.sumelectthermalfe: -647.169078 hartree
dipole: 5.9318 -1.0824 2.4238
dipole: 6.4986
quadrupole: -52.9162 -51.5619 -60.6535
quadrupole: -18.3445 6.1366 -3.4416
quadrupole: 2.1277 3.4820 -5.6096 -18.3445 6.1366 -3.4416
hfenergy: -647.3378006 hartree
pointgroup: C01 [X(C8H13N2O3)]
dipole: 2.1251484 -0.5266702 0.9061494 debye
dipolederiv: 0.3816991 0.1028025 0.134881 0.1382291 0.4111876 0.1322005 0.1635728 0.1250597 0.1611687 0.0568052 -0.3949931 0.0771338 -0.7930835 0.5304076 -0.3487625 0.038481 -0.2179552 -0.2103807 -0.5857356 0.3471135 -0.14354 0.9224996 -1.1749038 0.1255111 0.0400893 -0.3185763 -0.5748361 0.3812837 -0.0798204 -0.1193035 -0.2954965 0.7797826 0.4673582 -0.4862698 0.8775203 0.8487357 0.462195 -0.0037855 0.1069871 -0.000785 0.2541763 -0.0297401 0.1391993 -0.0469756 0.4473965 0.2596475 -0.0173106 -0.0267834 -0.0842814 0.4299094 -0.1301399 0.1017636 -0.3087661 0.7144305 -0.0763 -0.0073438 0.0777479 0.0298908 0.0222967 0.0435528 -0.0295189 0.0890726 -0.0178652 0.0254454 -0.0553009 -0.0503066 -0.0565188 -0.0449474 -0.0619888 -0.0315319 0.0481576 -0.0045896 -0.7174924 0.1321007 0.1044583 0.232385 -0.6259917 -0.173297 0.2016873 -0.3444456 -0.682341 0.4301105 -0.0807955 -0.0373944 -0.0640482 0.3579129 -0.0154797 -0.0313879 -0.0275953 0.3085486 0.5351116 -0.0553 -0.0750295 -0.0930386 0.2264388 -0.0016429 0.0427606 -0.0234465 0.2631267 -0.0410758 0.1150008 -0.0478908 0.0602072 -0.0034402 -0.0943329 -0.0878378 -0.0538751 0.251941 -0.1516183 -0.1230475 0.0717155 -0.1057904 -0.234951 0.2097159 -0.0740091 -0.0714406 -0.0321749 -0.1706175 -0.0073775 -0.0539815 -0.0635981 -0.0883444 -0.2550114 0.0628397 0.02279 -0.233718 0.1365269 0.1740484 -0.1185326 0.1622791 0.3373386 -0.2281965 0.0322103 0.0386886 0.1419489 0.1218615 -0.0185788 -0.0286147 -0.0125415 0.0947748 -0.0302302 -0.0104184 -0.0165742 0.0081483 0.0339216 0.0712746 0.1638351 0.1154055 0.1323299 0.2194006 0.0272888 -0.0019 0.3500832 0.123771 -0.0162167 0.0003932 -0.0398046 0.1380977 0.0331543 0.0102514 0.0302243 0.0821773 0.097319 -0.0255304 0.0264648 -0.0366263 0.0426825 0.0466398 0.0144109 0.0339547 0.0248871 0.1033983 -0.0179068 -0.0098709 -0.0198639 0.082553 -0.0070289 0.0007308 0.0064708 -0.0174585 -0.2921011 -0.0522579 -0.0162344 -0.0379332 -0.3772648 -0.0262281 -0.0293549 -0.0255208 -0.3258696 -0.5289888 0.2901772 -0.1253309 0.2753829 -1.1035047 0.3100768 -0.1772069 0.4002777 -0.7897398 0.4669167 -0.2948503 0.1270539 -0.221866 0.8886474 -0.2466051 0.0552876 -0.1609245 0.283502 -0.0132281 -0.0740736 -0.0706152 -0.0077036 -0.1086679 0.0132533 -0.0545638 -0.1016006 0.0311129 0.0802151 0.0311496 0.012056 0.0316721 0.0411065 -0.0150487 -0.0163174 0.0554142 -0.0664939 -0.1190704 0.0608221 0.0207018 -0.0349717 -0.0076264 0.0628691 0.0978434 -0.0080338 0.03826 unknown
polarizability: 103.4253076|7.1596812|130.8519749|11.4426892|-0.5712035|116.0695627 unknown
InChI: InChI=1/8C.2N.3O.13H
charge 1 multiplicity 1
26 atoms
C  0.41658022 0.95327196 0.76331578
N  1.50699151 0.99453087 1.42596208
O  2.05921657 -0.36304962 1.65130192
H  2.26211712 -0.96297166 0.72758709
H  2.86954357 -0.18220226 2.15325541
C  -0.19369904 2.32079859 0.53654656
H  -1.19587361 2.31722801 0.99568867
H  0.4190535 3.08255466 1.03708767
O  2.4795905 -1.64554422 -0.3684269
H  2.94176594 -2.49261901 -0.33665258
H  1.70050367 -1.73048049 -0.94100984
C  -0.25057064 -0.26503779 0.23606848
C  -0.72338324 -1.24630019 1.10765527
C  -0.40164106 -0.45113404 -1.14218991
C  -1.31000331 -2.38609041 0.55818029
H  -0.64351506 -1.13447498 2.18349652
C  -0.99084397 -1.63876217 -1.57813957
H  -0.08407399 0.31081943 -1.84461172
H  -1.69425297 -3.16836004 1.20647892
H  -1.12344439 -1.82409474 -2.64047719
N  -1.42815165 -2.59489796 -0.75379512
O  -0.25745756 2.51452223 -0.84530088
C  -0.902195 3.73094944 -1.2032793
H  -0.37608051 4.59201161 -0.77416488
H  -0.86970658 3.79248429 -2.29007899
H  -1.94597076 3.73193423 -0.86604318
