program: Gaussian 09
title: 000052685
version: EM64L-G09RevD.01
frameworkgroup: C1[X(C11H19NO)]
method: RPBEPBE
basis: SDD
operation: Freq
keyword: #p
keyword: freq=noraman
keyword: PBEPBE/SDD
title: #p freq=noraman PBEPBE/SDD
converged: YES YES NO NO
title: Mulliken charges:
elementType: O N C C C C C C C C C C C H H H H H H H H H H H H H H H H H H H
charge: -0.226886 -0.379340 0.272235 -0.026718 -0.462926 -0.459901 -0.473482 -0.493526 0.086049 -0.408141 -0.409367 -0.386201 -0.702492 0.185186 0.227001 0.234287 0.202157 0.196333 0.257389 0.184976 0.213674 0.226332 0.197994 0.193594 0.194686 0.201260 0.302410 0.198725 0.189245 0.207218 0.244507 0.213721
chargesum: 0.00000
title: Mulliken charges with hydrogens summed into heavy atoms:
elementType: O N C C C C C C C C C C C
charge: -0.226886 -0.076930 0.272235 0.158468 -0.001639 -0.061410 -0.031117 -0.053520 0.086049 -0.016553 -0.013421 0.001769 -0.037046
polarizability: 1.35332826e+02 6.47617994e-02 1.17088850e+02 -3.79046290e+00 5.59017813e+00 1.11716981e+02
1716.lowfreq: -0.0004 0.0005 0.0007 4.7166 15.2107 19.6803 65.1930 87.0094 95.8881
frequency: 65.1572 86.9643 95.8848 111.9825 135.7330 162.2484 205.6799 229.2727 257.0392 264.0954 309.0364 317.8498 352.1699 419.6419 436.2816 464.1419 491.5826 533.1515 580.0478 672.5268 713.0071 730.2243 779.7677 789.8395 801.7188 844.2235 879.6430 883.6135 901.0075 922.8285 929.9666 966.0608 986.6016 994.7747 1050.1281 1059.3375 1061.0182 1077.2923 1111.3331 1115.1067 1115.6040 1123.0370 1137.6603 1178.7843 1186.2339 1191.5119 1236.8246 1253.1338 1261.1555 1269.2846 1285.1315 1310.1190 1317.9406 1327.3650 1333.4903 1338.4268 1339.1506 1341.2633 1346.4418 1365.2874 1397.6720 1460.6518 1462.5637 1463.4845 1466.3387 1471.3565 1475.6005 1482.5840 1484.6895 1498.8717 1718.6077 2926.0662 2959.9281 2964.1788 2964.8752 2966.2630 2972.7655 2981.3297 2984.2194 3005.0993 3016.9705 3025.4881 3029.1200 3037.8461 3039.5407 3049.3010 3067.9346 3073.6181 3084.9723 3541.0450
redmass: 2.7106 2.2898 2.7382 7.7805 3.0656 2.5594 2.4223 1.7163 1.8770 2.3941 3.8602 1.9948 2.0640 2.1106 3.0264 2.2904 1.6244 1.6651 2.6968 3.8883 3.3060 3.6293 1.7306 1.4607 2.5326 1.9288 2.3767 1.7570 1.4097 1.8489 2.0640 2.0302 1.9466 1.9794 1.8311 2.0500 1.5236 1.2783 2.6223 1.2879 2.1522 1.8418 2.5588 2.7189 2.4740 1.6220 1.4894 1.4519 1.3028 1.3306 1.2453 1.2633 1.4441 1.5500 1.3664 1.3973 1.6246 1.5279 1.4248 1.4893 1.2043 1.0820 1.0866 1.0866 1.0886 1.0873 1.0592 1.0884 1.0580 1.0736 9.8932 1.0821 1.0588 1.0622 1.0636 1.0649 1.0629 1.0393 1.0582 1.0573 1.0981 1.0965 1.0996 1.1008 1.0991 1.1006 1.1082 1.0994 1.1007 1.0816
irintensity: 0.9448 0.0385 0.1747 3.7417 0.0191 2.1779 0.0960 0.5460 1.1693 1.0162 1.4436 1.3949 4.8745 29.6010 0.6194 6.1869 7.0083 91.8863 33.1552 2.7456 0.6903 3.3037 7.3207 0.1722 0.4814 7.3712 6.3164 0.6701 5.3822 1.4079 0.8928 6.3672 6.4955 9.3666 0.5797 1.6811 1.4578 0.0853 1.9664 1.8169 14.7904 22.2710 55.3138 6.9671 1.4334 2.7389 14.2685 1.2718 7.1788 1.3114 1.7615 1.8523 12.8655 0.8421 0.0981 0.1615 3.6009 0.4254 0.4830 2.4661 13.6871 0.7292 6.2585 5.5425 13.2043 13.9232 12.9407 7.3511 5.0230 10.6358 342.0961 15.9613 41.2526 41.4738 40.4881 12.5022 37.8177 33.8986 21.1827 39.7527 68.5499 73.3067 25.3551 69.9155 17.0753 49.9240 51.4483 39.6711 35.5966 11.7315
temp: 298.150 k
press: 1.00000 atm
elementType: 8 7 6 6 6 6 6 6 6 6 6 6 6 1 1 1 1 1 1 1 1 1 1 1 1 1 1 1 1 1 1 1
symmnumber: 1
zpe: 742395.3 jmol-1
zpe.correction: 0.282763 hartree
zpe.thermalcorrener: 0.296028 hartree
zpe.thermalcorrenthalpy: 0.296973 hartree
zpe.thermalcorrgfe: 0.243625 hartree
zpe.sumelectzpe: -559.506438 hartree
zpe.sumelectthermal: -559.493173 hartree
zpe.sumelectthermalent: -559.492229 hartree
zpe.sumelectthermalfe: -559.545577 hartree
dipole: -0.5954 -3.4414 -1.6996
dipole: 3.8841
quadrupole: -79.0730 -88.1130 -75.3140
quadrupole: -6.7632 -5.3916 -1.7924
quadrupole: 1.7603 -7.2797 5.5194 -6.7632 -5.3916 -1.7924
hfenergy: -559.7892017 hartree
pointgroup: C01 [X(C11H19N1O1)]
dipole: 0.2741233 1.2924568 -0.7678509 debye
polarizability: 135.4615014|-0.6112847|116.2866009|3.0470608|-6.0561959|112.3905548 unknown
InChI: InChI=1S/C11H19NO/c1-2-11(8-12-10(11)13)9-6-4-3-5-7-9/h9,12H,2-8H2,1H3
charge 0 multiplicity 1
32 atoms
O  -2.025391 -1.976338 0.321476
N  -2.411787 -0.328717 -1.412347
C  -0.887979 0.35841 -0.08584
C  0.613554 0.007717 -0.31707
C  -1.60064 0.921011 -1.387115
C  1.513558 1.263968 -0.464575
C  1.197038 -0.942622 0.763495
C  -1.162156 1.153648 1.214867
C  -1.832344 -0.892984 -0.273598
C  2.966833 0.866584 -0.822295
C  2.648509 -1.349204 0.412348
C  3.556257 -0.109488 0.224356
C  -2.656031 1.348959 1.55867
H  0.661655 -0.542017 -1.285487
H  -2.19574 1.839472 -1.241342
H  -0.934645 1.037626 -2.260767
H  1.522453 1.829784 0.489295
H  1.103989 1.944566 -1.238568
H  0.553946 -1.836264 0.86384
H  1.199185 -0.433195 1.748931
H  -0.666754 2.14183 1.141023
H  -0.679452 0.620412 2.055332
H  3.599588 1.772409 -0.899813
H  2.978154 0.381448 -1.820609
H  2.643889 -1.94471 -0.524437
H  3.05785 -2.005772 1.204437
H  -3.132728 -0.665777 -2.053882
H  4.575268 -0.421746 -0.076688
H  3.656454 0.417901 1.196134
H  -3.203021 1.879457 0.757403
H  -3.154475 0.377148 1.723833
H  -2.762037 1.945883 2.482893
