program: Gaussian 09
title: opt freq calcfc
version: EM64L-G09RevD.01
method: RwB97XD
basis: 6-31+G(d,p)
operation: Freq
keyword: #P
keyword: Geom=AllCheck
keyword: Guess=TCheck
keyword: SCRF=Check
keyword: GenChk
keyword: RwB97XD/6-31+G(d,p)
keyword: Freq
converged: YES YES YES YES
title: Mulliken charges:
elementType: C N O H H C H H C H H C C H H H O C H H H
charge: -0.110795 -0.217030 -0.148091 0.459497 0.350908 -0.059664 0.183872 0.189946 -0.288744 0.249057 0.240712 -0.166821 -0.302384 0.214501 0.218677 0.202858 -0.323938 -0.202523 0.163012 0.190393 0.156556
chargesum: 1.00000
title: Mulliken charges with hydrogens summed into heavy atoms:
elementType: C N O C C C C O C
charge: -0.110795 -0.217030 0.662315 0.314154 0.201025 0.047681 0.119152 -0.323938 0.307437
polarizability: 7.83951335e+01 -2.39881416e+00 1.09288709e+02 2.45161350e+00 4.79250138e+00 6.53674893e+01
1716.lowfreq: -6.8093 -0.0007 0.0004 0.0007 10.7416 22.0597 62.9656 77.0161 94.2309
frequency: 62.8698 76.7308 94.0361 145.0414 166.4340 206.1657 269.1418 295.4446 330.7399 348.4881 383.7974 443.3840 490.1248 531.1715 632.4725 674.6355 756.6882 852.9630 936.5928 940.0386 967.7512 1013.2027 1027.9187 1048.2041 1071.9127 1135.3661 1169.7055 1189.2185 1195.7092 1219.7407 1244.4219 1262.9654 1284.5779 1346.1194 1363.4139 1424.8043 1471.0136 1488.2190 1495.8572 1501.5587 1508.3577 1530.0139 1603.6077 1713.7759 1735.2967 2918.4404 2989.4079 3043.5802 3073.1062 3092.9442 3119.4010 3163.6200 3170.2999 3201.2816 3206.4491 3273.0361 3792.3551
redmass: 3.0971 1.8347 2.7301 3.5090 3.3229 1.4410 3.4262 2.3700 3.4247 3.1420 4.3649 2.0225 1.1950 3.3774 2.8196 2.1408 4.2381 2.2701 2.1597 1.4041 1.3587 2.7847 1.9544 1.3378 1.1029 1.6908 1.6987 1.6885 1.4391 1.5906 1.8875 1.3521 1.3441 1.2746 1.6928 1.4878 1.1857 1.0979 1.1183 1.0402 1.0676 1.0949 1.0847 4.1222 8.4548 1.0698 1.0645 1.0346 1.0963 1.0654 1.1073 1.0994 1.0617 1.0932 1.1015 1.1174 1.0691
irintensity: 0.3184 3.2116 4.1112 9.5240 3.4738 2.2484 18.3681 6.5319 22.4855 5.2752 10.6662 5.3303 94.2539 51.1280 75.8298 31.8405 42.7105 5.2381 15.5655 42.9275 59.8970 18.5662 61.8031 32.8407 58.6075 1.3459 83.2828 37.4290 14.8092 31.4305 67.9689 11.7913 3.3299 1.6720 12.0059 24.0244 4.3787 25.2066 0.0360 15.3673 13.8705 7.6053 80.4771 5.8733 14.9461 1096.6964 24.9896 41.9934 11.3847 2.1744 26.6507 8.2192 2.1747 0.5423 5.8252 0.0752 394.0361
temp: 298.150 k
press: 1.00000 atm
elementType: 6 7 8 1 1 6 1 1 6 1 1 6 6 1 1 1 8 6 1 1 1
symmnumber: 1
zpe: 476673.7 jmol-1
zpe.correction: 0.181555 hartree
zpe.thermalcorrener: 0.192076 hartree
zpe.thermalcorrenthalpy: 0.193021 hartree
zpe.thermalcorrgfe: 0.145450 hartree
zpe.sumelectzpe: -440.382031 hartree
zpe.sumelectthermal: -440.371510 hartree
zpe.sumelectthermalent: -440.370566 hartree
zpe.sumelectthermalfe: -440.418137 hartree
dipole: 1.5100 -4.8363 1.5857
dipole: 5.3089
quadrupole: -43.3011 -16.7467 -50.7066
quadrupole: -6.6448 0.9863 1.3218
quadrupole: -6.3829 20.1714 -13.7885 -6.6448 0.9863 1.3218
hfenergy: -440.5635868 hartree
pointgroup: C01 [X(C6H12N1O2)]
dipole: 0.5610255 -1.864468 0.5813101 debye
dipolederiv: 0.3951366 0.0698954 0.0837602 0.0615081 0.2518096 0.1180914 0.0851578 0.1642272 0.1715256 -0.2585941 -0.0490065 -0.0125148 -0.295564 0.9940652 0.2409608 -0.1604605 0.2807436 -0.1358071 -0.758954 -0.2675879 -0.0469186 0.2033034 -1.3290441 -0.1877 0.2322601 -0.2361739 -0.1792032 0.5339413 -0.1904616 -0.0044199 -0.1272116 0.3329896 -0.0255978 0.0176359 -0.0301075 0.3602437 0.9633654 0.4696761 0.0317564 0.2469636 0.2105468 -0.0505762 -0.1108713 -0.1370698 0.1948927 0.3842826 -0.1812723 0.0858927 -0.1530067 0.632777 -0.1930742 0.1276254 -0.366982 0.4890556 0.0006242 0.0273692 0.0936093 0.043255 -0.0508995 0.0113176 0.013146 0.0999187 -0.0573938 -0.0493227 0.0051002 -0.0450584 -0.0479301 0.0030926 -0.0112923 -0.016121 0.0660162 0.0528386 0.0752966 0.0904786 -0.0258527 -0.1138655 -0.1724307 -0.0629446 -0.0326001 -0.0481137 0.0197094 0.0727322 -0.0050347 0.0050708 0.0228606 0.0973104 0.0005884 0.0411657 0.0255159 0.1099545 0.0401739 -0.0297042 0.0380256 -0.029996 0.0550365 -0.0496144 0.0287177 0.0044787 0.0453456 -0.3419919 -0.1913018 -0.1455531 -0.0201042 0.2528733 -0.011204 -0.2208686 -0.1605145 0.0481427 -0.3009847 0.1269216 -0.0029428 0.1258255 -0.0390677 0.0175386 0.0385505 0.067575 0.0926832 0.1516889 0.014739 0.0235175 -0.011842 0.0218773 -0.018569 0.0350238 0.0099653 0.0003188 0.157345 -0.0331291 0.0214404 -0.0282235 0.0589624 0.0139084 0.0129788 0.0241278 0.0607949 0.145822 -0.0153263 0.0349897 -0.0148665 0.1024153 0.0427893 0.0384278 0.0079318 0.0016393 -0.499438 0.2534426 -0.0864196 0.234542 -1.3974651 0.0672512 -0.081934 0.1380573 -0.5432964 0.3191849 -0.0541497 -0.0664628 -0.1204296 1.0416084 0.0442321 -0.0933961 0.1715458 0.274537 -0.1056818 -0.1155124 -0.0077606 0.0107405 -0.0439922 0.0013248 0.0041875 -0.0509436 0.0732678 0.0556923 0.0564141 -0.0553789 0.0219089 0.0040156 -0.0007909 -0.0655033 0.0510531 0.0083313 0.0196814 0.0184498 0.0812195 -0.0078679 -0.0264807 0.0533611 0.1068779 -0.0812515 -0.0875804 unknown
polarizability: 78.3951335|-2.3988142|109.2887092|2.4516135|4.7925014|65.3674893 unknown
InChI: InChI=1/6C.N.2O.12H
charge 1 multiplicity 1
21 atoms
C  0.43735655 0.09015582 0.15112197
N  1.60057803 -0.39961624 0.33553641
O  1.63739326 -1.83922017 -0.16307938
H  2.43957534 -2.21826911 0.23549524
H  0.79669441 -2.35166857 0.08757328
C  0.32167947 1.52656137 0.61523046
H  -0.21418105 1.51946747 1.5809103
H  1.31939354 1.95519474 0.78009239
C  -0.76720702 -0.6125665 -0.41956736
H  -1.61196511 0.07920471 -0.37802296
H  -0.57906299 -0.81943434 -1.4796353
C  -1.07388917 -1.88390111 0.34545947
C  -1.10683783 -3.10488753 -0.20384448
H  -1.29518878 -1.76663067 1.40522129
H  -1.36212956 -3.97699824 0.38950701
H  -0.93541118 -3.26079111 -1.26765164
O  -0.39743164 2.19309482 -0.37435921
C  -0.57209798 3.57938154 -0.10022247
H  0.39668524 4.08930485 -0.04567023
H  -1.15138217 3.98602085 -0.92737452
H  -1.11881991 3.72432978 0.83954685
