program: Gaussian 09
title: 000052684
version: EM64L-G09RevD.01
frameworkgroup: C1[X(C12H15NO)]
method: RPBEPBE
basis: SDD
operation: Freq
keyword: #p
keyword: freq=noraman
keyword: PBEPBE/SDD
title: #p freq=noraman PBEPBE/SDD
converged: NO YES NO NO
title: Mulliken charges:
elementType: O N C C C C C C C C C C C C H H H H H H H H H H H H H H H
charge: -0.234314 -0.382347 0.249138 -0.438784 -0.611379 -0.446055 0.124068 0.497039 -0.697784 -0.461727 -0.394606 -0.225567 -0.246392 -0.245915 0.231174 0.237012 0.211288 0.224643 0.199769 0.244422 0.305383 0.205092 0.242313 0.217575 0.225068 0.295606 0.222559 0.226614 0.226106
chargesum: 0.00000
title: Mulliken charges with hydrogens summed into heavy atoms:
elementType: O N C C C C C C C C C C C C
charge: -0.234314 -0.076964 0.249138 0.029402 -0.175448 -0.001864 0.124068 0.497039 -0.032805 -0.236660 -0.099000 -0.003008 -0.019777 -0.019809
polarizability: 1.66023752e+02 -2.02144237e+00 1.29672261e+02 -1.62042274e+01 1.19400441e+01 9.55430217e+01
1716.lowfreq: -12.0720 -1.7579 -0.0007 -0.0005 0.0007 10.6362 35.8654 62.2089 89.9362
frequency: 35.7009 62.1724 89.9298 108.4488 124.6509 150.4060 192.4671 218.1731 252.9690 286.1949 308.3274 335.1247 406.4585 422.1450 464.9432 501.0014 554.7863 582.3541 617.1888 668.4937 699.2049 708.2204 722.8463 760.8928 779.9308 805.6025 846.9566 862.3688 916.1243 927.1002 952.9109 976.1900 983.2082 989.8172 992.9846 1005.3115 1030.1221 1056.8162 1084.0959 1112.5873 1119.9207 1133.1725 1161.0010 1171.1430 1173.0843 1199.2247 1215.0379 1232.4944 1258.2570 1292.0037 1318.5989 1327.6703 1345.1984 1348.6844 1381.1344 1396.6547 1440.1703 1459.9701 1461.3675 1477.0312 1484.4100 1488.3521 1496.2479 1591.1423 1614.9733 1716.2234 2960.3252 2972.4170 2981.9950 3003.5680 3013.6863 3040.6890 3068.3248 3075.2686 3083.3567 3109.4235 3121.7404 3132.0080 3142.3102 3159.6901 3546.8037
redmass: 3.7525 4.1789 2.4666 4.6813 3.5295 2.9661 4.3683 2.0496 2.0180 2.5935 2.3187 2.2879 2.8530 2.3386 3.0987 2.7063 1.4739 5.0499 6.2963 3.7451 4.3393 2.2030 2.2704 2.2720 1.5645 3.6571 2.1331 1.2666 1.5518 1.6306 1.8293 1.8962 1.4174 4.3557 1.9409 1.3441 2.2448 2.9945 1.6273 1.2395 1.6390 2.5475 1.9588 1.3838 1.8285 1.1919 2.0559 1.6003 1.4957 1.4509 1.6292 1.7384 1.3549 1.5293 6.1030 1.2095 2.0120 1.1041 1.1086 1.0665 1.0555 2.1823 1.0736 5.8570 5.7949 9.7413 1.0603 1.0643 1.0365 1.0583 1.0993 1.0959 1.1086 1.0995 1.1004 1.0871 1.0868 1.0921 1.0961 1.1015 1.0817
irintensity: 0.1792 1.3916 1.2632 4.6112 0.3658 0.1092 1.3909 2.8710 0.5283 2.6010 4.8992 2.7115 0.4498 31.6395 0.7889 4.8145 144.1024 1.2763 1.5327 7.1067 2.4059 42.7030 26.0058 28.4890 11.1639 3.5152 3.8501 0.6075 1.8573 2.1701 5.0533 5.9106 0.6171 1.0117 7.9953 3.0861 9.9030 0.4425 10.9145 1.9310 2.0241 78.9891 19.8777 4.6733 9.0090 0.5651 0.9065 11.1270 5.9447 5.4015 1.4486 14.2352 1.1889 1.6086 0.3456 14.7628 7.1985 5.6269 7.8624 14.4646 5.4797 22.8453 13.6797 2.3050 9.0200 341.4485 24.3598 27.8575 30.2072 49.4865 25.7121 3.1955 43.4324 36.5035 34.9505 10.2314 7.2599 16.2729 22.4110 40.6704 16.3532
temp: 298.150 k
press: 1.00000 atm
elementType: 8 7 6 6 6 6 6 6 6 6 6 6 6 6 1 1 1 1 1 1 1 1 1 1 1 1 1 1 1
symmnumber: 1
zpe: 635875.0 jmol-1
zpe.correction: 0.242192 hartree
zpe.thermalcorrener: 0.255446 hartree
zpe.thermalcorrenthalpy: 0.256390 hartree
zpe.thermalcorrgfe: 0.201967 hartree
zpe.sumelectzpe: -595.206465 hartree
zpe.sumelectthermal: -595.193211 hartree
zpe.sumelectthermalent: -595.192267 hartree
zpe.sumelectthermalfe: -595.246690 hartree
dipole: 1.8806 -3.4236 -1.0456
dipole: 4.0437
quadrupole: -70.8233 -86.5398 -83.2141
quadrupole: -3.7391 -6.3551 1.3256
quadrupole: 9.3691 -6.3474 -3.0217 -3.7391 -6.3551 1.3256
hfenergy: -595.4486573 hartree
pointgroup: C01 [X(C12H15N1O1)]
dipole: 0.8553544 0.9488543 0.9481762 debye
polarizability: 164.004633|-11.0577076|116.2020377|18.0243765|18.7454675|111.0323641 unknown
InChI: InChI=1S/C12H15NO/c1-2-12(9-13-11(12)14)8-10-6-4-3-5-7-10/h3-7,13H,2,8-9H2,1H3
charge 0 multiplicity 1
29 atoms
O  1.464111 -2.105876 -0.863306
N  3.096325 -1.221062 0.685475
C  1.508609 0.184177 0.442486
C  2.848448 0.117163 1.288693
C  0.247897 0.212641 1.35633
C  1.470172 1.273965 -0.65619
C  1.93119 -1.248612 -0.079485
C  -1.114548 0.223568 0.665185
C  2.647574 1.246974 -1.654209
C  -2.082939 1.188963 1.043002
C  -1.46291 -0.736901 -0.322757
C  -3.370307 1.198873 0.4585
C  -2.747902 -0.725564 -0.909352
C  -3.708106 0.23845 -0.521551
H  3.604707 0.877202 1.028091
H  2.696914 0.091244 2.382668
H  0.325332 1.116026 1.994274
H  0.304736 -0.658088 2.042525
H  1.418177 2.263667 -0.156544
H  0.523203 1.159207 -1.215326
H  3.855454 -1.895655 0.799453
H  3.626452 1.366699 -1.153782
H  2.667852 0.296683 -2.21741
H  2.547174 2.069363 -2.385458
H  -1.828213 1.938403 1.803605
H  -0.725251 -1.48348 -0.639359
H  -4.104336 1.952561 0.766243
H  -2.99973 -1.472732 -1.670781
H  -4.704581 0.241644 -0.97782
