program: Gaussian 09
title: opt freq calcfc
version: EM64L-G09RevD.01
method: RwB97XD
basis: 6-31+G(d,p)
operation: Freq
keyword: #P
keyword: Geom=AllCheck
keyword: Guess=TCheck
keyword: SCRF=Check
keyword: GenChk
keyword: RwB97XD/6-31+G(d,p)
keyword: Freq
converged: YES YES YES YES
title: Mulliken charges:
elementType: C N O H H C H H C H H C H H H O C H H H
charge: -0.222049 -0.081356 -0.382887 0.457422 0.453376 0.005519 0.194600 0.189992 -0.093149 0.248256 0.195356 -0.531152 0.197201 0.209889 0.183034 -0.328228 -0.213547 0.162963 0.193234 0.161525
chargesum: 1.00000
title: Mulliken charges with hydrogens summed into heavy atoms:
elementType: C N O C C C O C
charge: -0.222049 -0.081356 0.527911 0.390112 0.350463 0.058972 -0.328228 0.304175
polarizability: 9.49542480e+01 7.67799919e+00 7.45131969e+01 -1.49807309e+00 2.11123478e+00 5.95188910e+01
1716.lowfreq: -22.2257 -10.5211 0.0003 0.0003 0.0010 11.2912 54.5769 76.8288 94.8643
frequency: 53.7066 76.4634 94.4775 149.5897 159.9877 216.8496 223.0222 260.4689 280.3824 303.3740 318.9728 382.4475 462.7683 589.9684 645.5400 775.0013 815.0683 880.4632 922.9292 994.8115 1009.4807 1012.8025 1078.4976 1103.8018 1181.4985 1188.7982 1211.4066 1244.7753 1257.1797 1302.0294 1355.3990 1416.0918 1437.8612 1477.8895 1487.3454 1500.0794 1508.2369 1512.6607 1520.1501 1528.5953 1643.7278 1714.8198 3005.8535 3044.4827 3071.4398 3087.6265 3093.8281 3123.3648 3172.9452 3180.3097 3191.4150 3204.6990 3724.5530 3828.4340
redmass: 3.1512 2.3880 2.4058 2.5734 1.2018 1.4441 1.3687 2.4859 4.5516 3.2947 1.8515 3.1022 4.4853 3.4594 2.7896 2.5459 1.3679 1.3401 1.1988 1.6648 2.2015 3.0933 2.1761 1.7790 2.4641 1.2621 2.5414 1.7506 1.3831 1.2784 1.3296 1.3321 1.1965 1.0859 1.0899 1.0860 1.0519 1.0394 1.0830 1.0560 1.0840 8.7661 1.0610 1.0343 1.0999 1.0402 1.0608 1.1075 1.1018 1.1030 1.1022 1.1020 1.0439 1.0856
irintensity: 5.4225 1.6818 7.8622 1.7151 67.6660 2.1760 2.0188 4.3968 122.8336 12.6054 5.1480 24.4457 110.8686 14.8309 25.5829 37.0447 12.0302 198.8933 6.3655 1.3048 7.2461 51.3614 13.2492 2.6299 130.9533 2.5048 12.5388 54.3987 24.2031 1.8011 2.2905 23.8622 4.5792 9.3014 12.6606 9.8434 14.9185 10.5356 19.0473 4.8718 134.1355 18.9763 18.6388 39.6052 8.8324 7.2965 6.8890 23.9066 6.3586 0.6315 5.6363 4.4638 379.9363 252.2235
temp: 298.150 k
press: 1.00000 atm
elementType: 6 7 8 1 1 6 1 1 6 1 1 6 1 1 1 8 6 1 1 1
symmnumber: 1
zpe: 460732.0 jmol-1
zpe.correction: 0.175484 hartree
zpe.thermalcorrener: 0.186190 hartree
zpe.thermalcorrenthalpy: 0.187134 hartree
zpe.thermalcorrgfe: 0.139337 hartree
zpe.sumelectzpe: -402.317399 hartree
zpe.sumelectthermal: -402.306692 hartree
zpe.sumelectthermalent: -402.305748 hartree
zpe.sumelectthermalfe: -402.353546 hartree
dipole: 5.6933 2.5299 0.7104
dipole: 6.2705
quadrupole: -10.7463 -37.1506 -44.1239
quadrupole: 10.0949 -1.7540 -0.5639
quadrupole: 19.9273 -6.4770 -13.4503 10.0949 -1.7540 -0.5639
hfenergy: -402.4928822 hartree
pointgroup: C01 [X(C5H12N1O2)]
dipole: 2.1856188 0.9715433 0.2524876 debye
dipolederiv: -0.1352501 -0.0890632 -0.0094762 -0.1175502 0.3481745 0.1268547 0.0024512 0.1825456 0.1802227 1.5579176 0.3296764 -0.2829295 0.1690168 -0.2055778 -0.0185122 -0.3514896 -0.1387191 -0.1286244 -1.709454 -0.3897009 0.1925532 0.0259692 -0.2534022 -0.0085014 0.384645 0.1104716 -0.3206436 0.2969344 0.0361771 -0.0426607 0.1330051 0.4080307 -0.049561 -0.1770619 -0.0933551 0.4331675 0.4480002 0.0314044 0.0843478 0.0013158 0.3507696 0.0000321 0.2392149 0.056236 0.3560935 0.8454237 0.1043749 0.206542 -0.0467367 0.30121 0.0425185 0.394497 0.0038212 0.4647616 -0.111132 -0.0490185 0.0139769 0.0029171 0.0187038 0.091745 -0.0877282 0.0493131 -0.0178011 0.0413869 0.0356312 -0.0003001 -0.0214748 -0.0482226 -0.0605292 -0.088279 -0.006716 0.0547445 0.0538597 -0.0669632 -0.0178479 -0.0028798 -0.015048 -0.0353397 0.0102991 -0.0398684 -0.0152716 0.1102709 0.0596633 -0.0323799 -0.0068442 0.036013 0.0245293 -0.0315566 0.0234613 0.0723439 -0.0309051 -0.0051093 0.0513228 -0.0414317 0.0045342 0.0063859 0.0084242 0.0011096 0.0805806 0.0635438 0.0893916 0.0482393 0.0032135 0.0705889 -0.0275932 0.0148133 -0.1320634 0.0685524 -0.0634145 -0.0250237 0.0317435 0.0189019 0.0855842 0.0174632 0.0209354 0.0360946 0.0550802 0.0828935 0.0288547 0.0284869 0.017841 -0.0298234 -0.0326884 0.0412928 -0.0376872 0.0481281 0.0361012 -0.0240219 -0.0700039 -0.0376359 0.0519981 -0.0292312 -0.0586665 0.0405076 -0.0593382 -1.4682241 0.0347031 -0.1043759 0.0638059 -0.4270942 -0.0416262 -0.2320477 -0.0335009 -0.5342452 1.0295251 -0.0814978 -0.0510279 -0.1973182 0.3370033 -0.0345324 -0.1875203 -0.0353502 0.2481171 -0.0100845 -0.0420071 -0.0132936 0.0774691 -0.1214958 -0.0296345 0.0564597 -0.036102 0.0703039 -0.0101866 0.0014397 -0.0121505 -0.0202976 0.0872046 -0.0418543 -0.0654251 -0.0350562 -0.0016862 -0.0272059 0.0210893 -0.0207664 -0.0212863 0.0008493 0.1000748 0.1067422 0.0848579 -0.054486 unknown
polarizability: 94.954248|7.6779992|74.5131969|-1.4980731|2.1112348|59.518891 unknown
InChI: InChI=1/5C.N.2O.12H
charge 1 multiplicity 1
20 atoms
C  0.53508794 0.25711794 0.11912553
N  1.19740968 1.3009016 0.38631489
O  2.77184246 1.06944956 -0.11518489
H  2.90933643 1.77048642 -0.77713499
H  3.2913606 1.31155288 0.67196434
C  -0.89776089 0.45367812 0.6280114
H  -1.00502526 -0.21284777 1.50025529
H  -1.05384118 1.48772344 0.96532686
C  0.89244933 -1.01803079 -0.57686596
H  0.29919766 -1.01110694 -1.49892118
H  1.94917535 -1.01150516 -0.84254426
C  0.53213081 -2.2585527 0.25283961
H  -0.545769 -2.33750648 0.40610621
H  0.85604142 -3.14663558 -0.29241352
H  1.0359061 -2.25871987 1.22277403
O  -1.72408604 0.09733689 -0.42852792
C  -3.10510223 0.33539079 -0.16366499
H  -3.2870358 1.40102832 0.01713779
H  -3.6445693 0.01852597 -1.05445792
H  -3.4415584 -0.2512664 0.69914607
