program: Gaussian 09
title: opt freq calcfc
version: EM64L-G09RevD.01
method: RwB97XD
basis: 6-31+G(d,p)
operation: Freq
keyword: #P
keyword: Geom=AllCheck
keyword: Guess=TCheck
keyword: SCRF=Check
keyword: GenChk
keyword: RwB97XD/6-31+G(d,p)
keyword: Freq
converged: YES YES YES YES
title: Mulliken charges:
elementType: C N O H H C H H O H H C H H C H H H O C H H H
charge: -0.196344 -0.166887 -0.415222 0.576720 0.450048 0.028014 0.181816 0.180306 -0.773792 0.425402 0.432415 -0.131916 0.235692 0.183745 -0.530042 0.191670 0.200615 0.177769 -0.343591 -0.203367 0.157107 0.185647 0.154192
chargesum: 1.00000
title: Mulliken charges with hydrogens summed into heavy atoms:
elementType: C N O C O C C O C
charge: -0.196344 -0.166887 0.611546 0.390136 0.084025 0.287521 0.040012 -0.343591 0.293580
polarizability: 1.00175623e+02 3.65216560e+00 7.78898892e+01 3.03353138e+00 3.91609369e+00 6.98405808e+01
1716.lowfreq: -9.5575 -0.0005 0.0008 0.0015 5.7028 11.3419 21.8549 42.0546 68.4242
frequency: 15.7203 41.9029 67.8954 86.0457 95.2930 120.0043 169.1845 219.5753 229.5665 237.7257 267.9202 298.7845 334.4555 345.3530 391.1266 445.4617 452.7772 560.3923 602.5292 633.7464 734.9671 809.1769 830.5988 999.2500 1012.9322 1018.7594 1092.0007 1108.6474 1115.8279 1185.4083 1192.0436 1247.9017 1257.4719 1263.4567 1325.6028 1367.9614 1428.3885 1430.0812 1443.3274 1490.9183 1493.3236 1507.0709 1508.9023 1516.1904 1520.2464 1529.7613 1629.6489 1670.5742 1714.7476 2329.2490 3000.1356 3037.3438 3071.6546 3082.8930 3099.3496 3111.3352 3167.7765 3178.5029 3191.0536 3195.8964 3797.2494 3869.1613 3980.0949
redmass: 4.4142 3.6348 2.6444 3.1532 2.4510 1.0550 2.7512 1.2306 1.5292 1.1875 3.1972 2.4926 2.5056 2.7917 2.7566 3.7082 1.1965 1.5867 2.4067 2.7864 4.8017 3.0792 1.3784 1.5908 2.2584 3.9631 1.6524 1.4497 1.4827 1.3531 2.3343 1.8148 1.9473 1.2837 1.5150 1.3507 1.4725 1.0730 1.2068 1.0841 1.1094 1.0793 1.0580 1.0563 1.0662 1.0512 1.1078 1.1519 5.1510 1.0866 1.0632 1.0349 1.0973 1.0376 1.0641 1.1067 1.1019 1.1029 1.1008 1.1012 1.0663 1.0436 1.0858
irintensity: 1.3758 2.8060 1.7482 2.1440 6.9975 15.1060 1.5074 241.0608 18.3207 6.1171 20.5837 23.4746 11.3946 50.0956 91.0450 44.3755 97.8676 36.0770 16.3746 16.4450 110.0116 25.5114 2.6029 9.0061 2.2499 67.0186 15.5839 23.1322 53.4811 18.5959 88.2124 66.1161 2.1526 15.3705 5.7216 3.1461 21.3528 77.2166 2.6574 1.0649 12.6994 8.7347 13.8733 10.1342 13.8440 9.9282 59.1094 26.5300 46.0560 3583.4681 20.7520 43.3877 16.6055 11.3030 5.1853 28.8092 8.6127 0.6481 10.1493 7.7368 271.5678 87.5542 213.5123
temp: 298.150 k
press: 1.00000 atm
elementType: 6 7 8 1 1 6 1 1 8 1 1 6 1 1 6 1 1 1 8 6 1 1 1
symmnumber: 1
zpe: 527387.7 jmol-1
zpe.correction: 0.200871 hartree
zpe.thermalcorrener: 0.214165 hartree
zpe.thermalcorrenthalpy: 0.215109 hartree
zpe.thermalcorrgfe: 0.159621 hartree
zpe.sumelectzpe: -478.742755 hartree
zpe.sumelectthermal: -478.729462 hartree
zpe.sumelectthermalent: -478.728518 hartree
zpe.sumelectthermalfe: -478.784006 hartree
dipole: 6.8853 1.9800 0.3553
dipole: 7.1731
quadrupole: -8.6520 -39.0648 -47.9083
quadrupole: 10.6432 -4.6670 -3.8266
quadrupole: 23.2230 -7.1897 -16.0333 10.6432 -4.6670 -3.8266
hfenergy: -478.9436269 hartree
pointgroup: C01 [X(C5H14N1O3)]
dipole: 2.5918947 0.8108157 0.0187904 debye
dipolederiv: 0.3275045 0.0538898 0.0293054 0.1421281 0.3395978 0.2135717 0.1155248 0.2896467 0.3039625 0.9465921 -0.1295393 -0.1196249 -0.4902654 -0.2911221 0.0011457 -0.3355881 -0.0949535 -0.2690522 -1.6553827 -0.2276324 0.1048633 0.025006 -0.5952023 0.1901299 0.4929284 0.2292207 -0.3399267 0.743056 0.4918964 -0.2538758 0.891342 1.0195342 -0.4225595 -0.5510689 -0.4807453 0.5527401 0.3748418 -0.0192679 0.0907347 -0.0599987 0.3632649 -0.0466574 0.1882095 -0.0230417 0.3766393 0.5321404 -0.0539654 0.223335 -0.1803686 0.3671318 -0.0829153 0.3780174 -0.1271213 0.4956785 -0.0722853 -0.048548 0.0276731 0.0193185 -0.0332429 0.0953271 -0.0750048 0.0674348 0.0071914 0.0360551 0.0135257 -0.0135122 0.0016372 -0.0526138 -0.0921348 -0.0829865 -0.0152394 0.0063149 -0.8143766 -0.2114101 0.0565428 -0.3625437 -0.8022327 0.1290252 0.1646814 0.1441509 -0.6210747 0.3624491 0.0034193 0.0392631 0.0216229 0.3760546 0.0392717 0.0503244 0.0523017 0.3315106 0.4363574 0.0055414 -0.0024751 -0.0371047 0.2889727 0.038729 -0.0142782 0.0181634 0.3656426 -0.0195175 -0.0723411 -0.0510551 -0.0646721 -0.0486677 -0.074762 -0.0290013 -0.0774445 -0.048881 0.1240657 0.0326606 -0.0150516 -0.031311 0.0148318 0.0265598 -0.0369087 0.023137 0.0563631 -0.0641194 0.0090532 0.0509741 0.000862 0.0262591 -0.025984 0.0101568 -0.0133535 0.0710272 0.0948768 0.0769443 0.0701299 0.0165631 0.1156674 -0.0214321 -0.0216653 -0.1004648 0.0333335 -0.0774878 0.0008208 0.026147 0.0440826 0.0621507 0.0121443 0.0356097 0.0270896 0.0707553 0.0750709 -0.0025711 0.0210438 -0.0234936 -0.0189448 -0.0662279 0.0258212 -0.0783965 0.0077707 0.033567 0.0055835 -0.0699024 -0.0142868 0.0318397 0.0271157 -0.0425255 0.0930013 -0.05516 -1.2754139 0.2528238 -0.1214819 0.2938886 -0.5097198 0.0408444 -0.1745185 0.0513845 -0.5798097 0.9447023 -0.1835951 -0.0374432 -0.1917638 0.4189989 -0.0002384 -0.1828949 0.0384613 0.2379787 -0.0133657 -0.0382604 -0.0410227 0.0521316 -0.0964339 -0.0781922 0.0584393 -0.1104286 0.0223019 -0.0036201 0.0275743 -0.0188771 0.0234673 0.0904286 -0.0004466 -0.0797804 0.0202705 -0.0335994 -0.0357103 0.0133976 0.0043099 -0.0762414 -0.0665523 0.0976857 0.1065081 0.0669267 0.0082933 unknown
polarizability: 100.1756234|3.6521656|77.8898892|3.0335314|3.9160937|69.8405808 unknown
InChI: InChI=1/5C.N.3O.14H
charge 1 multiplicity 1
23 atoms
C  0.07957339 -0.21387881 0.36823962
N  0.9968678 0.39456526 1.01851064
O  2.36954158 -0.1438294 0.60389168
H  2.84778688 0.6612792 0.12250997
H  2.81815914 -0.30153212 1.45157529
C  -1.2987625 0.25411924 0.79679658
H  -1.72101687 -0.53375742 1.44402942
H  -1.22121241 1.17390467 1.39224553
O  3.48816543 1.76765585 -0.49853661
H  3.17187643 2.67255853 -0.39981779
H  4.03140738 1.7117991 -1.29216924
C  0.18197181 -1.26651655 -0.68958715
H  -0.26957935 -0.82634877 -1.58565912
H  1.22564093 -1.49490176 -0.90247855
C  -0.59166774 -2.53993973 -0.31263574
H  -1.6599224 -2.34028016 -0.20725363
H  -0.46773525 -3.27835233 -1.10670593
H  -0.21704894 -2.97881427 0.61592551
O  -2.05008153 0.43041951 -0.36483229
C  -3.39120048 0.81921528 -0.10174092
H  -3.42465178 1.77523757 0.43498764
H  -3.87781095 0.92985508 -1.06962799
H  -3.91200635 0.05172145 0.48475041
