program: Gaussian 09
title: opt freq calcfc
version: EM64L-G09RevD.01
method: RwB97XD
basis: 6-31+G(d,p)
operation: Freq
keyword: #P
keyword: Geom=AllCheck
keyword: Guess=TCheck
keyword: SCRF=Check
keyword: GenChk
keyword: RwB97XD/6-31+G(d,p)
keyword: Freq
converged: YES YES YES YES
title: Mulliken charges:
elementType: C N O H H C H H O H H C C C C H C H C H H O C H H H O C H H H
charge: -0.649982 -0.101085 -0.288836 0.561704 0.401177 -0.232555 0.149976 0.172708 -0.763328 0.424464 0.430114 0.819665 -0.697782 -0.612974 0.220858 0.167673 0.812310 0.193513 -0.467199 0.196439 0.176798 -0.319769 -0.151645 0.162846 0.191640 0.168662 -0.280298 -0.169096 0.153544 0.182989 0.147467
chargesum: 1.00000
title: Mulliken charges with hydrogens summed into heavy atoms:
elementType: C N O C O C C C C C C O C O C
charge: -0.649982 -0.101085 0.674046 0.090129 0.091250 0.819665 -0.530109 -0.419461 0.417297 0.989108 -0.467199 -0.319769 0.371503 -0.280298 0.314905
polarizability: 1.93528913e+02 -4.36011040e+00 1.32756915e+02 2.41129524e+00 1.31575178e+01 1.13526684e+02
1716.lowfreq: -11.3718 -5.5846 -3.7985 0.0005 0.0010 0.0011 32.4090 35.5853 40.1634
frequency: 32.2589 35.5791 40.0743 47.0923 71.8457 93.9983 105.1634 115.4354 144.9255 164.7052 204.2560 208.9257 273.6436 276.4464 306.0819 310.1852 342.2945 365.1620 371.5872 423.7655 435.2836 455.4399 510.1225 532.1306 543.5849 589.9762 624.8905 657.4980 686.4788 706.7489 765.3081 805.0344 843.6590 849.6758 870.6170 988.9634 1005.3005 1013.1042 1026.4332 1029.3102 1080.5968 1113.0118 1155.2473 1167.7756 1180.0999 1187.3420 1190.5304 1218.1352 1232.6353 1245.5456 1267.2565 1318.5286 1342.8853 1357.4985 1380.2345 1412.1371 1434.1699 1482.3708 1485.6976 1498.7389 1499.3423 1506.2935 1520.0675 1524.1010 1524.5700 1575.1178 1634.2239 1639.6109 1669.7707 1683.5590 1723.7500 2294.4203 2986.8891 3029.8048 3059.0232 3064.8027 3099.9555 3141.9663 3199.4330 3211.3247 3225.8843 3235.8843 3259.0710 3270.9357 3537.4362 3861.8876 3969.2375
redmass: 3.5834 4.2364 4.0127 3.3267 2.3314 1.5986 1.9614 3.5640 3.7164 4.5841 2.9153 1.6031 2.5369 1.4957 2.5616 2.9347 2.9422 4.5680 1.4549 3.0221 3.7067 3.7582 1.4822 2.9134 2.9550 1.5637 2.9070 5.4504 4.4194 3.6524 5.1862 4.7689 4.8172 1.2885 1.7797 1.3005 1.3434 2.1104 3.0259 2.7576 6.7255 1.9640 1.4417 1.4088 1.3307 1.9976 1.2751 1.2943 1.2395 2.5194 1.2011 2.7353 3.8254 1.5467 4.6909 1.1147 1.4877 1.2174 2.6479 1.0461 1.2014 1.0658 1.0608 1.0833 1.0614 2.8224 5.6861 1.1279 1.4330 4.0661 3.4541 1.1027 1.0648 1.0356 1.0340 1.0948 1.1066 1.1078 1.0998 1.1024 1.0913 1.0903 1.0956 1.0928 1.0661 1.0438 1.0850
irintensity: 0.3510 3.9571 1.0188 0.3575 5.4253 14.0870 18.6473 0.3494 10.6349 5.7079 2.2587 1.4789 0.3695 0.6857 21.2467 35.3032 27.8657 5.5189 220.6692 3.2377 5.5334 223.2603 27.8769 10.1624 30.8987 66.0483 5.7043 12.3558 36.0347 15.9776 38.7178 137.2293 10.4582 3.8570 67.6954 2.1664 1.7637 13.3231 48.4891 5.0935 56.3215 21.7496 88.1902 13.2279 20.9642 83.8008 0.2962 16.3906 65.5517 101.1834 10.2676 59.4993 99.4745 1.5167 320.4047 41.5656 49.7664 3.0348 5.7135 12.4689 7.4009 12.8972 43.8102 9.0971 23.6736 145.8758 7.0749 82.3478 113.9951 320.6165 29.8446 4682.2797 28.4991 54.1021 36.0890 21.7236 31.1294 21.5404 8.2769 6.5033 0.2826 2.5246 0.0241 1.6226 302.4148 99.4884 196.5214
temp: 298.150 k
press: 1.00000 atm
elementType: 6 7 8 1 1 6 1 1 8 1 1 6 6 6 6 1 6 1 6 1 1 8 6 1 1 1 8 6 1 1 1
symmnumber: 1
zpe: 679310.1 jmol-1
zpe.correction: 0.258736 hartree
zpe.thermalcorrener: 0.276063 hartree
zpe.thermalcorrenthalpy: 0.277007 hartree
zpe.thermalcorrgfe: 0.211641 hartree
zpe.sumelectzpe: -745.557110 hartree
zpe.sumelectthermal: -745.539783 hartree
zpe.sumelectthermalent: -745.538839 hartree
zpe.sumelectthermalfe: -745.604205 hartree
dipole: 5.2845 -7.2681 0.4799
dipole: 8.9990
quadrupole: -33.5148 -39.2142 -82.9397
quadrupole: -18.5254 10.6919 4.4476
quadrupole: 18.3748 12.6754 -31.0502 -18.5254 10.6919 4.4476
hfenergy: -745.8158456 hartree
pointgroup: C01 [X(C10H16N1O4)]
dipole: 2.0289145 -2.8420136 0.2377729 debye
polarizability: 193.5289131|-4.3601104|132.7569155|2.4112952|13.1575178|113.5266841 unknown
InChI: InChI=1/10C.N.4O.16H
charge 1 multiplicity 1
31 atoms
C  1.60460167 0.08538525 -0.0132095
N  2.37222268 -0.90793101 -0.28059422
O  1.59937554 -2.15453583 -0.45928229
H  2.21869776 -2.92652164 -0.09258878
H  0.71827474 -2.08755796 -0.02478167
C  2.36654292 1.36067062 0.26784584
H  2.27957919 1.57519846 1.34784833
H  3.43142198 1.20890523 0.04209981
O  3.08813176 -3.91750786 0.41261947
H  3.93790245 -3.63371559 0.76972988
H  3.22462992 -4.74461463 -0.0636831
C  0.13465485 0.06580718 0.07178162
C  -0.50896193 0.6330464 1.18864102
C  -0.64858473 -0.43868765 -0.97617082
C  -1.88386313 0.64936758 1.27060421
H  0.07350182 1.05537217 2.00102515
C  -2.03710416 -0.40841671 -0.91010141
H  -0.17591717 -0.81405454 -1.87950801
C  -2.6641939 0.13112678 0.22065109
H  -2.38956895 1.07221061 2.13105196
H  -2.61332261 -0.78451463 -1.74603676
O  -3.98665631 0.20677784 0.39294535
C  -4.85382199 -0.2736355 -0.62834397
H  -4.70186421 -1.34493897 -0.79651042
H  -5.86274548 -0.10280617 -0.2584949
H  -4.70550349 0.28106379 -1.56041038
O  1.79117924 2.36718042 -0.504543
C  2.39809983 3.63276488 -0.29974015
H  3.46282361 3.60765599 -0.56469003
H  1.87930557 4.33505631 -0.95067793
H  2.2895894 3.95468674 0.74444756
