program: Gaussian 09
title: opt freq
version: EM64L-G09RevD.01
method: RwB97XD
basis: 6-31+G(d,p)
operation: Freq
keyword: #P
keyword: Geom=AllCheck
keyword: Guess=TCheck
keyword: SCRF=Check
keyword: GenChk
keyword: RwB97XD/6-31+G(d,p)
keyword: Freq
converged: YES YES YES YES
title: Mulliken charges:
elementType: C N O H H C H H H O H H C H H H O
charge: -0.082195 -0.148193 -0.402583 0.576715 0.454842 -0.075984 0.186886 0.188517 0.242046 -0.771170 0.430648 0.436454 -0.203980 0.155138 0.190904 0.158123 -0.336168
chargesum: 1.00000
title: Mulliken charges with hydrogens summed into heavy atoms:
elementType: C N O C O C O
charge: 0.159851 -0.148193 0.628974 0.299419 0.095932 0.300185 -0.336168
polarizability: 8.33936999e+01 3.04276002e+00 4.76365915e+01 2.84027625e+00 -1.11676156e+00 5.00395908e+01
1716.lowfreq: -10.2071 0.0005 0.0007 0.0008 4.4032 20.6566 50.7364 69.3885 87.5088
frequency: 40.2635 67.0809 85.5204 116.7028 127.2267 168.5011 238.9323 240.9751 307.1895 326.7824 410.2742 433.9990 468.2701 573.7206 640.0039 773.6464 906.5484 1000.6894 1064.7190 1120.5894 1156.6063 1190.8216 1195.1928 1245.2264 1258.5020 1320.3805 1421.0587 1479.7107 1496.4914 1506.7518 1509.9091 1529.3215 1619.2950 1668.0634 1730.7309 2124.1237 2985.6225 3035.5828 3062.3328 3109.8959 3196.5581 3201.9867 3772.0300 3861.7295 3972.0416
redmass: 4.3100 3.5733 3.6212 1.9708 1.3831 2.7598 1.1728 1.2451 2.8072 3.6464 3.0649 4.6461 1.1767 1.5787 2.0724 7.8144 1.3034 3.6091 1.8268 1.6613 1.3706 2.1840 1.4245 1.5522 1.4975 1.3086 1.4882 1.0757 1.1246 1.0456 1.0738 1.0841 1.1117 1.1139 5.6951 1.0924 1.0636 1.0353 1.0961 1.1070 1.0962 1.1008 1.0662 1.0435 1.0862
irintensity: 0.9537 0.6313 1.2597 5.9611 11.2316 25.1892 104.5619 180.7854 35.1879 30.0505 107.5143 90.5970 64.6928 62.7602 2.7232 121.4137 13.1877 60.3021 15.4923 40.6753 45.5455 88.4953 34.4316 63.5299 19.5843 9.5245 51.5507 96.5399 1.0860 13.7409 14.2296 9.2601 78.9030 22.5048 11.0287 3977.5737 25.2506 39.7294 14.2842 29.6106 3.7309 6.5458 254.9455 98.0708 234.2357
temp: 298.150 k
press: 1.00000 atm
elementType: 6 7 8 1 1 6 1 1 1 8 1 1 6 1 1 1 8
symmnumber: 1
zpe: 375397.7 jmol-1
zpe.correction: 0.142981 hartree
zpe.thermalcorrener: 0.153529 hartree
zpe.thermalcorrenthalpy: 0.154473 hartree
zpe.thermalcorrgfe: 0.106544 hartree
zpe.sumelectzpe: -400.171986 hartree
zpe.sumelectthermal: -400.161439 hartree
zpe.sumelectthermalent: -400.160495 hartree
zpe.sumelectthermalfe: -400.208424 hartree
dipole: 7.9100 -0.5837 -1.2243
dipole: 8.0255
quadrupole: 12.4766 -38.7973 -33.5988
quadrupole: -2.6267 -0.7201 1.9467
quadrupole: 32.4498 -18.8241 -13.6256 -2.6267 -0.7201 1.9467
hfenergy: -400.3149678 hartree
pointgroup: C01 [X(C3H10N1O3)]
dipole: 3.1033369 -0.2276192 -0.4229655 debye
dipolederiv: 0.3883499 0.0817403 0.0916078 0.0884656 0.2081398 -0.0385786 0.0923555 -0.0159388 0.2218513 0.5630603 -0.0706567 0.329915 -0.3505811 -0.1696961 -0.1860185 0.6681185 -0.0845294 0.0391454 -1.6760374 0.0404815 -0.0343787 0.3337913 -0.2228084 0.088709 -0.2149945 -0.0266316 -0.6711003 1.5239016 -0.1153364 -0.5494816 -0.1796578 0.315284 0.08409 -0.9956526 0.1039948 0.6405765 0.286472 0.0379751 0.0065393 0.1309645 0.3535666 0.0655724 0.0730042 0.0596006 0.4628201 0.7770247 0.025689 -0.2147368 -0.0514661 0.3611542 0.0047312 -0.3891179 0.0079575 0.3757923 -0.0815176 -0.0274514 -0.0300813 0.0517513 -0.010627 -0.0897381 0.0764243 -0.0562341 -0.0109266 -0.0024092 0.0003128 0.0072365 -0.0257823 -0.0508014 0.0773787 0.0780064 0.0293165 0.0363088 0.101899 0.0116204 -0.041575 -0.0198526 0.1263959 0.0212162 -0.0464899 0.041393 0.1136145 -1.0835415 0.0021026 0.1607422 0.0196403 -0.5617874 -0.0276627 0.3296733 -0.0417066 -0.6592821 0.3489677 0.0466571 0.0250188 0.0737291 0.3858878 -0.0297642 0.0090357 -0.0205673 0.3634093 0.4017348 -0.0056296 0.051466 -0.0467482 0.3932663 0.0107924 0.0855976 -0.001151 0.3254526 0.8897142 -0.0375687 0.1892869 -0.0900064 0.3670025 0.0116319 0.3533724 0.0116517 0.3271866 -0.0078108 0.0403753 0.0217787 -0.0170121 -0.0461385 -0.1142404 -0.0976521 -0.0939891 -0.0391311 -0.0316878 -0.0026797 0.0200692 -0.0125653 0.0984251 0.0187826 0.0739249 0.0168757 0.0024664 -0.0045652 -0.0491222 0.006667 0.0507846 -0.111651 0.0803601 -0.0825835 0.063257 0.0324817 -1.3935547 0.0214906 -0.0400741 0.0445453 -0.4356125 0.022738 -0.0130222 0.0067011 -0.5606651 unknown
polarizability: 83.3936999|3.04276|47.6365915|2.8402763|-1.1167616|50.0395908 unknown
InChI: InChI=1/3C.N.3O.10H
charge 1 multiplicity 1
17 atoms
C  -0.14873527 -0.23738881 0.20430926
N  0.84809473 0.52196258 -0.00336511
O  1.98176595 0.03872664 0.87542486
H  2.82981497 -0.0500031 0.22826988
H  2.14653663 0.76496776 1.50284019
C  -1.40685917 0.00822753 -0.57662325
H  -1.4485311 -0.75088123 -1.37781715
H  -1.38512459 1.00105323 -1.04808564
H  -0.13929396 -1.05207215 0.92911898
O  3.93360203 -0.13302423 -0.59941222
H  3.98588554 0.33532397 -1.44050687
H  4.53344024 -0.88736543 -0.61889752
C  -3.73283827 0.00715189 -0.25109497
H  -3.89424287 -0.75295009 -1.02573423
H  -4.45788586 -0.13008679 0.54939805
H  -3.85228523 1.00711545 -0.68545708
O  -2.44690872 -0.1394994 0.33878438
