program: Gaussian 09
title: opt freq
version: EM64L-G09RevD.01
method: RwB97XD
basis: 6-31+G(d,p)
operation: Freq
keyword: #P
keyword: Geom=AllCheck
keyword: Guess=TCheck
keyword: SCRF=Check
keyword: GenChk
keyword: RwB97XD/6-31+G(d,p)
keyword: Freq
converged: YES YES NO YES
title: Mulliken charges:
elementType: C N O H H C H H O H H C H H C F F F C F F F
charge: -0.054002 -0.136120 -0.378275 0.597154 0.456787 -0.392686 0.244928 0.243288 -0.743574 0.432497 0.436282 -0.399677 0.259805 0.250847 0.931110 -0.243946 -0.241172 -0.358185 0.915198 -0.264998 -0.288403 -0.266858
chargesum: 1.00000
title: Mulliken charges with hydrogens summed into heavy atoms:
elementType: C N O C O C C F F F C F F F
charge: -0.054002 -0.136120 0.675666 0.095530 0.125206 0.110975 0.931110 -0.243946 -0.241172 -0.358185 0.915198 -0.264998 -0.288403 -0.266858
polarizability: 8.73806437e+01 -8.02248766e+00 8.76925478e+01 2.33445240e+00 4.99730166e+00 6.60882638e+01
1716.lowfreq: -10.9943 -8.9903 -5.5859 -0.0009 0.0003 0.0007 28.0405 37.5612 47.0391
frequency: 26.7359 37.4004 47.0083 60.8028 67.7241 97.5473 122.6799 136.2741 178.5519 238.3831 263.8516 304.6392 313.2605 350.0921 368.0185 385.7959 424.6855 462.6942 510.8575 524.4763 531.6342 532.8699 536.6202 552.6353 622.4426 644.8972 665.5388 761.7431 829.9348 839.6108 865.0343 907.9134 936.1386 970.3138 1076.3733 1144.9086 1179.4732 1217.6100 1233.8205 1239.9552 1272.0431 1301.3192 1303.4940 1332.4502 1399.5196 1412.5924 1487.6800 1489.5311 1498.5048 1605.7398 1655.7782 1754.4200 1894.4069 3115.4356 3127.8287 3186.9951 3200.2767 3578.3880 3850.0664 3956.8129
redmass: 10.0294 7.3745 8.2576 4.7029 7.1680 1.3282 3.3578 9.2528 7.0413 6.7701 10.2775 5.6425 6.0820 2.0411 3.4205 2.8582 2.5826 2.8969 1.5175 8.7265 9.6968 4.8420 7.8612 4.7006 1.4268 4.8532 3.9349 8.0257 7.4787 4.0165 5.6287 3.1922 2.2899 2.3578 2.2693 2.0268 1.2192 3.4048 2.7834 3.1114 5.4118 2.9625 3.1540 2.0648 2.1185 2.1568 1.0999 1.0609 1.0933 1.1389 1.1792 5.1187 1.1099 1.0618 1.0635 1.1063 1.1037 1.0671 1.0435 1.0859
irintensity: 3.1060 4.9716 4.6581 4.2266 2.9292 14.6318 17.1902 0.6388 11.2964 7.0587 2.5819 9.2911 11.9220 103.4205 27.1674 94.0506 33.6704 259.0918 26.2263 26.8291 12.7374 26.0230 0.3373 58.1848 119.6739 8.2649 34.0464 15.2752 6.5372 100.8249 53.9828 32.0516 28.0730 19.8780 99.8835 268.3762 18.6637 136.1272 126.5040 192.9178 206.9005 116.6559 261.4273 111.6820 114.2563 205.7368 48.6604 227.8743 13.4210 308.8169 224.0450 1.9946 4009.7607 3.3091 4.6222 3.3107 9.6974 384.4116 110.0681 232.4370
temp: 298.150 k
press: 1.00000 atm
elementType: 6 7 8 1 1 6 1 1 8 1 1 6 1 1 6 9 9 9 6 9 9 9
symmnumber: 1
zpe: 392579.9 jmol-1
zpe.correction: 0.149526 hartree
zpe.thermalcorrener: 0.164853 hartree
zpe.thermalcorrenthalpy: 0.165797 hartree
zpe.thermalcorrgfe: 0.104539 hartree
zpe.sumelectzpe: -998.926957 hartree
zpe.sumelectthermal: -998.911630 hartree
zpe.sumelectthermalent: -998.910686 hartree
zpe.sumelectthermalfe: -998.971944 hartree
dipole: 7.9484 -6.7409 0.0154
dipole: 10.4220
quadrupole: -36.4327 -61.3272 -71.2618
quadrupole: -24.5723 0.8524 5.6921
quadrupole: 19.9078 -4.9866 -14.9212 -24.5723 0.8524 5.6921
hfenergy: -999.0764825 hartree
pointgroup: C01 [X(C5H8F6N1O2)]
dipole: 3.1434853 -2.6465706 0.0064935 debye
dipolederiv: 0.4448417 -0.0660601 0.1015316 -0.0344523 0.4639525 0.1150916 0.1987669 0.1913327 0.1719393 -0.3215407 0.0425688 -0.0130211 -0.3575392 0.6061535 0.2916336 -0.3077986 0.4741144 -0.049003 -1.0886888 0.2917417 -0.0805162 0.6049317 -1.1585052 -0.2236611 0.1302355 -0.3951678 -0.2850887 1.9197628 -0.8397036 0.0566317 -0.5544757 0.5247239 -0.050795 0.2152124 -0.131059 0.2864753 0.5560085 0.1923517 0.008577 0.1235005 0.3603977 -0.0380727 -0.0340525 -0.0705043 0.2696244 -0.0964033 0.0346417 0.0039626 0.0246294 -0.2467859 0.0406212 -0.0549371 0.1273117 -0.0768406 0.0604026 -0.0189653 0.0167655 0.0105849 0.0430129 0.0107803 0.0118962 -0.0073376 0.1185691 0.0639737 -0.0015546 -0.0408685 0.0022645 0.0613427 0.0123243 -0.0201026 -0.0037914 0.0961321 -1.1427268 0.3694006 -0.0337316 0.2674415 -0.6783774 0.0347416 -0.1065621 0.0708518 -0.5245439 0.3396453 -0.0025903 0.0335818 -0.0032186 0.3725849 -0.0227028 0.0688864 -0.0402772 0.3983772 0.3292875 -0.0223057 -0.0318119 -0.0465654 0.4234362 0.0126043 -0.0805466 0.0427357 0.3793398 -0.1674749 -0.0408477 -0.017329 -0.1479033 -0.2004942 -0.023979 0.0245764 -0.0153198 -0.0482657 0.078171 0.0105601 0.0125777 0.0147734 0.1265525 0.0068572 -0.0000234 -0.0102426 0.1213061 0.047746 -0.0149284 0.0303139 -0.0096419 0.0704991 -0.0381133 0.0008587 -0.0279539 0.0930115 1.854668 0.0924169 0.0896331 0.1125337 1.5873091 0.1111743 -0.0327179 0.068488 1.5112227 -0.748103 -0.214317 -0.3096869 -0.2812053 -0.3723526 -0.1597473 -0.2599503 -0.0994393 -0.4663017 -0.4524738 0.0357378 0.2255406 0.0053604 -0.3664536 -0.1153585 0.2674033 -0.1671442 -0.6958356 -0.7019012 0.1519251 -0.0494459 0.2563238 -0.7369002 0.1268223 -0.0463429 0.1643484 -0.3250576 1.6178014 0.0742768 0.0058238 -0.035582 1.9304628 0.1171926 0.0700269 -0.1000619 1.5010305 -0.2675992 0.0099361 0.0195311 0.0597689 -0.9666235 -0.3163577 0.0157397 -0.2256137 -0.4427694 -0.6092526 -0.0247908 -0.2790983 0.0330068 -0.4389636 0.062303 -0.3413936 0.0669016 -0.584319 -0.7161441 -0.0594936 0.2510391 -0.0445357 -0.4049716 0.0466412 0.280825 0.0878286 -0.4490031 unknown
polarizability: 87.3806437|-8.0224877|87.6925478|2.3344524|4.9973017|66.0882638 unknown
InChI: InChI=1/5C.6F.N.2O.8H
charge 1 multiplicity 1
22 atoms
C  0.21950123 0.08374374 0.1668646
N  1.32645081 -0.51471213 0.39202536
O  1.42724764 -1.77316731 -0.36040742
H  2.44125863 -2.13129369 -0.17655586
H  0.73617482 -2.39890099 -0.04778451
C  0.0831449 1.3843551 0.91550899
H  -0.89276285 1.42399163 1.40792946
H  0.86554156 1.46459494 1.67188458
O  3.68292663 -2.56612012 0.06783089
H  4.19457714 -2.15774642 0.77705811
H  4.2793576 -2.79282309 -0.65623105
C  -0.89330812 -0.40693422 -0.72910522
H  -1.53785606 0.4268189 -1.01073439
H  -0.48888442 -0.85060081 -1.64256277
C  -1.76384021 -1.4440044 -0.03323248
F  -2.73463546 -1.87256942 -0.82088856
F  -2.28578091 -0.97895283 1.10140661
F  -1.00793529 -2.54776889 0.31384141
C  0.20185739 2.5974657 -0.00478898
F  0.13117324 3.72020033 0.70559955
F  -0.78512748 2.61995635 -0.92376633
F  1.3664573 2.58248022 -0.67000136
