program: Gaussian 09
title: opt freq
version: EM64L-G09RevD.01
method: RwB97XD
basis: 6-31+G(d,p)
operation: Freq
keyword: #P
keyword: Geom=AllCheck
keyword: Guess=TCheck
keyword: SCRF=Check
keyword: GenChk
keyword: RwB97XD/6-31+G(d,p)
keyword: Freq
converged: YES YES NO NO
title: Mulliken charges:
elementType: C N O H H C H H O H H C H H C C H H H C F F F
charge: 0.019730 -0.250751 -0.221264 0.573052 0.355665 -0.472973 0.232789 0.239625 -0.760377 0.427230 0.430938 -0.355205 0.232262 0.238548 -0.113045 -0.291248 0.205331 0.210793 0.194029 0.932652 -0.271967 -0.267020 -0.288795
chargesum: 1.00000
title: Mulliken charges with hydrogens summed into heavy atoms:
elementType: C N O C O C C C C F F F
charge: 0.019730 -0.250751 0.707454 -0.000559 0.097791 0.115605 0.092287 0.113574 0.932652 -0.271967 -0.267020 -0.288795
polarizability: 9.02368023e+01 2.95290059e+00 1.06956601e+02 2.69900093e+00 8.37589988e+00 7.13362719e+01
1716.lowfreq: -17.2155 -6.1885 -0.0009 -0.0008 -0.0007 8.0190 29.8259 45.0732 50.3471
frequency: 28.9836 44.9258 49.7722 57.7300 84.0911 117.4457 132.7340 145.7342 228.3172 272.1521 284.6279 303.4504 326.0391 377.2232 393.8647 430.7574 445.3466 506.2185 530.2276 536.5393 566.0394 628.8280 647.3506 729.9361 763.4225 835.0542 851.8422 895.1759 928.0743 951.3556 974.4139 1026.1152 1054.7891 1099.5710 1144.7983 1198.1120 1216.7144 1220.5430 1255.3504 1286.9342 1304.4481 1338.1987 1355.1550 1399.5104 1457.0795 1465.7951 1479.2952 1489.6829 1634.7223 1673.2946 1718.0945 1749.7410 2189.4256 3087.7182 3114.0722 3158.3307 3171.9722 3184.7546 3197.0982 3208.8539 3277.2368 3858.1059 3964.3390
redmass: 8.3121 5.4248 3.2724 3.3958 4.8601 1.2497 3.8921 3.2155 3.6585 3.8438 3.8296 7.1665 4.9651 1.4061 2.4365 3.9931 1.8703 1.3748 6.3251 6.9689 3.1424 2.1707 2.9924 1.6529 3.2227 4.1012 3.2951 2.6905 2.1229 1.9426 2.1884 1.3081 1.1255 1.5441 1.9276 1.2045 1.7706 4.1489 2.1451 2.5857 2.0007 1.2759 1.8985 2.1659 1.0875 1.1809 1.1134 1.0971 1.1056 1.1929 4.3483 4.4833 1.1109 1.0646 1.0617 1.1008 1.0617 1.1061 1.0927 1.0707 1.1164 1.0439 1.0851
irintensity: 1.4355 1.7573 4.6474 0.7203 4.8895 20.6478 15.7531 2.9270 2.5725 7.5697 7.8217 3.7744 7.6185 200.1956 14.7903 242.5893 7.3435 12.2158 39.3333 0.9420 43.5879 29.6399 16.6923 60.2662 3.8370 13.8107 97.2310 29.8929 13.9661 1.3448 32.7916 69.0373 40.3889 17.7318 59.8551 99.5926 30.8858 227.7381 89.6997 138.3081 141.2862 1.3951 6.0238 168.9636 82.4918 10.7221 39.1745 2.6723 45.0769 8.0348 10.6331 12.7428 4344.2925 0.1076 1.1493 2.9496 2.6483 2.4015 8.8705 808.6141 0.0549 97.2383 207.5277
temp: 298.150 k
press: 1.00000 atm
elementType: 6 7 8 1 1 6 1 1 8 1 1 6 1 1 6 6 1 1 1 6 9 9 9
symmnumber: 1
zpe: 466827.9 jmol-1
zpe.correction: 0.177805 hartree
zpe.thermalcorrener: 0.192067 hartree
zpe.thermalcorrenthalpy: 0.193011 hartree
zpe.thermalcorrgfe: 0.134772 hartree
zpe.sumelectzpe: -739.313095 hartree
zpe.sumelectthermal: -739.298833 hartree
zpe.sumelectthermalent: -739.297889 hartree
zpe.sumelectthermalfe: -739.356128 hartree
dipole: 1.5130 -10.6796 1.4906
dipole: 10.8888
quadrupole: -42.1909 -33.5255 -62.4604
quadrupole: -14.5839 0.0049 5.9817
quadrupole: 3.8680 12.5334 -16.4015 -14.5839 0.0049 5.9817
hfenergy: -739.4908999 hartree
pointgroup: C01 [X(C6H11F3N1O2)]
dipole: 0.5807756 -4.1907178 0.5860215 debye
dipolederiv: 0.4840093 0.0228834 0.1061202 0.0169463 0.4530963 0.0960377 0.1695369 0.1903594 0.1240996 -0.3703173 0.376316 0.0922484 0.0112984 0.615132 0.3155026 -0.1178822 0.4507549 -0.051804 -1.1087037 0.0238301 -0.1327196 0.425593 -1.3258187 -0.2245783 0.1216854 -0.3469267 -0.2635719 1.3126246 -0.9994561 0.0025628 -0.8659996 0.9936505 -0.0446513 0.150829 -0.1576502 0.285777 0.9402275 0.1490181 -0.0280078 0.0502323 0.1174522 -0.0671091 -0.1862026 -0.1076689 0.1915256 -0.0709217 0.0164026 -0.0027318 -0.0039733 -0.217027 0.0526318 -0.029335 0.1303689 -0.0628131 0.0483809 -0.0172609 0.0517379 0.0027303 0.0337572 0.0042853 0.0365956 -0.0013725 0.0880248 0.0408257 -0.007649 -0.0288433 0.0060701 0.0532939 0.0175536 -0.0111279 -0.0028455 0.0999774 -0.8901783 0.3841947 -0.0074954 0.3527927 -0.8791046 0.0381855 -0.0759857 0.0955085 -0.5270912 0.3361584 0.0055689 0.0179928 0.0013311 0.3587922 -0.0309929 0.0485378 -0.0547453 0.3829413 0.3053001 0.0164531 -0.0176497 -0.0126144 0.420132 0.0145312 -0.052069 0.0477135 0.3690012 0.0330448 0.0067768 -0.0420853 -0.1927242 -0.1276587 -0.0604886 -0.0580318 -0.0595425 0.0223971 0.0684721 -0.0014777 0.0018941 0.0155451 0.0392295 -0.0178805 0.0449648 -0.0083858 0.1012703 0.0300309 -0.017639 0.0246809 -0.0240751 0.0785153 -0.049539 0.0237775 0.0039711 0.0199567 -0.369081 0.0248422 -0.1079002 0.1983707 0.2311769 0.0321775 -0.2070107 -0.0542841 0.0743121 -0.2218138 0.1591502 0.0325129 0.1527167 -0.1335142 -0.0216822 0.0941271 0.002016 0.0845802 0.142732 -0.0286272 0.0046449 -0.0549819 0.0332346 -0.0169513 0.0216765 0.0036103 -0.015469 0.1330693 -0.057084 0.015101 -0.0581296 0.0673394 0.0147546 0.0110874 0.0299679 0.0589537 0.1410158 -0.0298773 0.0354909 -0.0264846 0.1045374 0.0440613 0.0263956 0.0072001 -0.0127655 1.6477712 0.1180241 -0.0036168 0.0819921 1.9392382 0.1025016 -0.0118949 -0.1588368 1.4860904 -0.3243437 -0.1997586 -0.0817826 -0.1859334 -0.9938438 -0.2673477 -0.063819 -0.1615534 -0.3990389 -0.5446077 0.0169575 0.2804274 0.0215003 -0.4031139 -0.0174262 0.3257777 0.0229829 -0.6308035 -0.7636952 0.0384123 -0.2125819 0.0877971 -0.4584966 0.0864243 -0.2616326 0.1293582 -0.4255504 unknown
polarizability: 90.2368023|2.9529006|106.9566015|2.6990009|8.3758999|71.3362719 unknown
InChI: InChI=1/6C.3F.N.2O.11H
charge 1 multiplicity 1
23 atoms
C  -0.10325035 -0.04857644 0.33195377
N  0.87429431 -0.87469922 0.31097755
O  0.51474514 -2.1156095 -0.37240112
H  1.32144119 -2.78569672 -0.19332106
H  -0.38168776 -2.45070039 -0.08255132
C  0.25324033 1.26678306 0.97427237
H  -0.49554833 1.53168219 1.72593992
H  1.23126791 1.19952692 1.45392874
O  2.38901947 -3.6440145 0.04810933
H  3.05113697 -3.39159637 0.70266806
H  2.84043243 -4.07986212 -0.68442931
C  -1.49527292 -0.32103107 -0.18803417
H  -2.12462758 0.5499158 0.00580555
H  -1.44616092 -0.44513103 -1.27644061
C  -2.10048159 -1.54437175 0.47084744
C  -2.52700181 -2.62404201 -0.19283452
H  -2.20311875 -1.50509296 1.55414831
H  -2.98187724 -3.4584643 0.33069538
H  -2.47901415 -2.68619099 -1.27859165
C  0.31598195 2.40037751 -0.04584229
F  0.67896645 3.53599685 0.55012767
F  1.20026864 2.12673899 -1.0164596
F  -0.87900152 2.60207721 -0.63596882
