program: Gaussian 09
title: opt freq
version: EM64L-G09RevD.01
method: RwB97XD
basis: 6-31+G(d,p)
operation: Freq
keyword: #P
keyword: Geom=AllCheck
keyword: Guess=TCheck
keyword: SCRF=Check
keyword: GenChk
keyword: RwB97XD/6-31+G(d,p)
keyword: Freq
converged: YES YES YES YES
title: Mulliken charges:
elementType: C N O H H C H H C H H H C F F F
charge: -0.007141 -0.090088 -0.332572 0.465178 0.465484 -0.384925 0.257406 0.255535 -0.401685 0.236437 0.258745 0.216350 0.864985 -0.260734 -0.267967 -0.275009
chargesum: 1.00000
title: Mulliken charges with hydrogens summed into heavy atoms:
elementType: C N O C C C F F F
charge: -0.007141 -0.090088 0.598090 0.128017 0.309847 0.864985 -0.260734 -0.267967 -0.275009
polarizability: 7.47624588e+01 3.77358849e+00 5.71128675e+01 -5.93779446e+00 6.28952529e-01 4.83786120e+01
1716.lowfreq: -0.0003 0.0004 0.0009 6.0634 13.3211 24.2887 47.4807 74.5678 133.6512
frequency: 47.1026 74.3181 133.6410 161.0183 178.5528 266.8297 281.0539 315.1385 337.8511 407.0792 465.8603 512.6866 536.2952 543.4794 669.3728 701.3549 820.8193 865.1531 917.8121 936.8357 996.1826 1036.2088 1059.5937 1148.5024 1226.5527 1258.2374 1268.8654 1305.6884 1396.7024 1417.0657 1471.1942 1477.6637 1501.1167 1649.2529 1714.9304 3086.7060 3114.2750 3174.0952 3183.8292 3225.4060 3697.3105 3795.2678
redmass: 4.9717 6.1668 1.7252 1.3716 1.3271 6.2238 6.1921 5.8380 4.4889 2.4944 4.1735 3.7228 7.4428 11.1978 6.3257 3.9305 3.5714 4.1003 1.4408 1.6630 1.2398 1.7004 1.6110 1.8419 2.9184 5.9112 5.0471 2.1161 2.0788 1.2044 1.0855 1.0676 1.0807 1.1045 6.3615 1.0419 1.0612 1.0940 1.1068 1.1059 1.0439 1.0860
irintensity: 1.6999 4.9948 8.6442 34.6683 30.7299 7.2354 4.2298 0.1065 14.4255 8.7819 80.5411 36.9655 2.5930 47.0915 19.1511 28.5866 23.4167 28.5464 157.8591 30.0841 7.9492 4.4079 9.4275 111.0940 169.1314 149.8053 96.2071 153.6143 152.8997 30.7577 10.0810 20.8649 21.3917 128.4579 29.0696 8.9260 5.6453 3.3939 5.2555 1.4436 376.0596 287.6889
temp: 298.150 k
press: 1.00000 atm
elementType: 6 7 8 1 1 6 1 1 6 1 1 1 6 9 9 9
symmnumber: 1
zpe: 313283.4 jmol-1
zpe.correction: 0.119323 hartree
zpe.thermalcorrener: 0.129194 hartree
zpe.thermalcorrenthalpy: 0.130138 hartree
zpe.thermalcorrgfe: 0.083717 hartree
zpe.sumelectzpe: -585.539736 hartree
zpe.sumelectthermal: -585.529866 hartree
zpe.sumelectthermalent: -585.528921 hartree
zpe.sumelectthermalfe: -585.575342 hartree
dipole: 11.1150 0.3414 0.8950
dipole: 11.1562
quadrupole: -12.5380 -44.5722 -43.5312
quadrupole: 5.5168 -5.5122 -0.9088
quadrupole: 21.0091 -11.0251 -9.9840 5.5168 -5.5122 -0.9088
hfenergy: -585.6590592 hartree
pointgroup: C01 [X(C4H7F3N1O1)]
dipole: 4.3479358 0.1067682 0.3599944 debye
dipolederiv: 0.3194068 0.0142735 -0.0205284 0.0450476 0.54993 0.0708804 -0.0350589 0.0712378 0.1443489 1.0538508 -0.0542765 -0.4324475 -0.2913054 -0.2596721 0.0616317 -0.5269176 -0.0018934 -0.0239922 -1.3995198 -0.0926799 0.3329275 0.2559467 -0.2225128 -0.09791 0.4907577 0.0245064 -0.3881773 0.2824874 0.0234323 -0.0355687 0.0657295 0.3643843 -0.0253893 -0.1829824 -0.0506266 0.5072486 0.5230753 0.0509065 0.0717175 0.0720738 0.3703716 -0.0120972 0.2061349 0.0205231 0.3371763 -0.1808573 0.0009582 -0.061972 -0.1647826 -0.0848089 0.0211863 -0.1280411 -0.0349036 -0.0903584 0.0135128 0.0026948 0.0038989 0.027149 0.0857849 0.0419432 -0.0217649 0.0271218 0.1073007 0.0796482 -0.0130838 -0.0146438 -0.0150019 0.0673108 -0.0017612 -0.0112043 0.0103693 0.123793 -0.0441709 -0.0230846 0.0264921 -0.0106268 -0.1719698 -0.0672319 -0.0103133 -0.1404593 -0.0457552 0.0994064 0.0111106 0.0588049 -0.0105005 0.1023756 -0.0141208 0.0475054 0.028004 0.0684978 0.134346 0.0397588 -0.036042 -0.0018454 0.0912057 0.044513 -0.0301191 0.036721 0.0873172 0.0005529 0.0248471 0.0041095 -0.0317362 0.0663911 -0.0111113 0.0055798 0.0097924 0.1200878 1.8968284 -0.0663494 -0.0899038 -0.0214658 1.6382532 -0.0455261 0.2058512 -0.0353776 1.4902432 -0.9323232 0.2515375 0.1863594 0.2552174 -0.3854205 -0.0969971 0.0637688 -0.073839 -0.3310113 -0.4067034 -0.0301725 0.0518486 -0.0374532 -0.3617122 0.1869048 0.0258251 0.2192934 -0.8016911 -0.4395405 -0.1398727 -0.0450522 -0.1364463 -0.849911 -0.0549144 -0.0990214 -0.1104698 -0.305028 unknown
polarizability: 74.7624588|3.7735885|57.1128675|-5.9377945|0.6289525|48.378612 unknown
InChI: InChI=1/4C.3F.N.O.7H
charge 1 multiplicity 1
16 atoms
C  0.98775601 -0.11817854 0.40219217
N  1.77720918 0.87764056 0.28958645
O  3.18000122 0.35413944 -0.2857757
H  3.25460509 0.75651935 -1.17226929
H  3.84204014 0.78455606 0.28771175
C  -0.34385827 0.37532734 0.93850356
H  -0.57350665 -0.16733334 1.8601135
H  -0.30147558 1.44427595 1.15791165
C  1.20586589 -1.55717747 0.08173117
H  0.68873475 -2.17568249 0.81699751
H  0.74544937 -1.76544854 -0.89066091
H  2.26107666 -1.81918355 0.04204344
C  -1.47336854 0.14378577 -0.06625393
F  -2.58561934 0.73355428 0.35803105
F  -1.14483406 0.65025109 -1.26713067
F  -1.72376936 -1.16521236 -0.23349502
