program: Gaussian 09
title: opt freq
version: EM64L-G09RevD.01
method: RwB97XD
basis: 6-31+G(d,p)
operation: Freq
keyword: #P
keyword: Geom=AllCheck
keyword: Guess=TCheck
keyword: SCRF=Check
keyword: GenChk
keyword: RwB97XD/6-31+G(d,p)
keyword: Freq
converged: YES YES YES YES
title: Mulliken charges:
elementType: C N O H H C H H H O H H C F F F
charge: 0.007923 -0.130497 -0.411224 0.583224 0.457625 -0.396939 0.253321 0.249968 0.246113 -0.766169 0.434004 0.439993 0.855001 -0.269574 -0.270695 -0.282073
chargesum: 1.00000
title: Mulliken charges with hydrogens summed into heavy atoms:
elementType: C N O C O C F F F
charge: 0.254036 -0.130497 0.629625 0.106349 0.107828 0.855001 -0.269574 -0.270695 -0.282073
polarizability: 7.56148252e+01 2.81018091e+00 4.73201350e+01 5.01824861e+00 -9.75864579e-01 4.84186617e+01
1716.lowfreq: -0.0017 -0.0016 -0.0013 7.5762 11.0708 22.2582 39.3283 62.1327 70.8812
frequency: 27.6142 62.0463 69.9242 79.3652 136.0019 165.0504 234.4544 281.5249 303.2630 353.8133 390.6044 415.6456 471.4623 523.7914 538.1319 591.7834 639.4487 672.1641 796.5209 852.1550 920.1357 1011.9016 1099.9632 1153.1830 1185.1211 1229.1025 1265.7381 1306.9045 1343.7611 1413.8588 1480.5774 1501.2787 1602.8570 1654.5168 1737.5193 1962.0507 3100.7133 3177.0919 3191.7249 3763.6143 3857.3638 3967.4120
redmass: 5.5149 5.6285 6.2051 6.0386 1.2263 2.2814 1.2228 7.1235 6.2100 5.8559 2.6267 4.4185 1.1353 6.7281 6.8895 1.6034 3.2732 4.1268 7.1765 4.3189 1.8462 1.5728 2.2189 1.1888 2.1898 3.6010 5.6567 2.0117 1.5398 1.9725 1.1027 1.0660 1.1273 1.0972 5.9442 1.0962 1.0629 1.1048 1.0961 1.0662 1.0433 1.0866
irintensity: 0.5282 0.2839 0.2521 2.5214 5.7270 35.0550 279.5478 12.8901 3.8048 7.9095 3.0791 240.8740 80.1764 64.2621 0.9939 28.5351 11.8191 15.6091 86.6675 3.4575 33.1630 45.5047 32.7260 142.4243 47.9450 211.7854 213.2859 142.6349 120.1814 134.4573 21.4319 108.0374 195.3931 57.6038 11.7898 4000.6094 4.5968 2.2037 6.8666 252.2022 108.9729 245.9855
temp: 298.150 k
press: 1.00000 atm
elementType: 6 7 8 1 1 6 1 1 1 8 1 1 6 9 9 9
symmnumber: 1
zpe: 302243.4 jmol-1
zpe.correction: 0.115118 hartree
zpe.thermalcorrener: 0.126281 hartree
zpe.thermalcorrenthalpy: 0.127225 hartree
zpe.thermalcorrgfe: 0.076598 hartree
zpe.sumelectzpe: -622.677900 hartree
zpe.sumelectthermal: -622.666737 hartree
zpe.sumelectthermalent: -622.665793 hartree
zpe.sumelectthermalfe: -622.716420 hartree
dipole: 13.4826 -0.8744 -1.3085
dipole: 13.5741
quadrupole: 6.8141 -47.2399 -41.0353
quadrupole: -1.3263 -1.9496 0.8666
quadrupole: 33.9678 -20.0862 -13.8816 -1.3263 -1.9496 0.8666
hfenergy: -622.7930184 hartree
pointgroup: C01 [X(C3H7F3N1O2)]
dipole: 5.2793726 -0.3559941 -0.519127 debye
dipolederiv: 0.5481111 0.0701311 0.1239969 0.0488582 0.2169886 -0.033566 0.2002158 -0.0119936 0.190819 0.3965459 -0.090585 0.3389259 -0.4073304 -0.1275435 -0.2137432 0.6400345 -0.0980637 0.0752355 -1.6175202 0.0068734 -0.069454 0.2756452 -0.2291073 0.1665669 -0.2215817 0.0390669 -0.6464999 1.7273865 -0.0009924 -0.4994451 0.006555 0.2918313 0.0183496 -0.9341688 0.0270726 0.5436805 0.2760132 0.0348486 -0.0028286 0.1129988 0.3414106 0.0526707 0.0695002 0.0458869 0.4846287 -0.290989 -0.0115842 0.0381687 -0.0881342 -0.0277661 -0.0229444 0.0773814 -0.0013357 -0.0889369 0.0413667 0.0023294 -0.0133116 0.0519968 0.0798659 -0.0222379 -0.0143037 -0.0208207 0.107655 0.0584287 -0.025593 0.0141227 -0.0013178 0.0587898 0.0263043 0.004107 0.0033842 0.1103813 0.0937229 0.0153417 -0.0542002 -0.0064404 0.1200735 0.0206473 -0.0492847 0.0374136 0.1203382 -1.1467193 -0.0290948 0.1345977 -0.0376412 -0.549479 -0.0129986 0.2986714 -0.0205794 -0.6362508 0.3418196 0.044642 0.0304904 0.0778472 0.4004872 -0.0214132 0.0187183 -0.0143063 0.3716353 0.3931713 -0.0208746 0.0545871 -0.0710746 0.3951302 0.0204102 0.0817117 0.0115381 0.3465519 1.9361207 0.0040808 0.1230258 0.0110673 1.6819763 0.0164603 -0.1359861 0.0033639 1.5515401 -0.9109433 0.119854 -0.3226172 0.1344195 -0.3078976 0.0836772 -0.2192551 0.0684438 -0.467276 -0.4084078 0.0056273 0.0270674 0.0027913 -0.5612489 -0.2917371 0.0611981 -0.3296224 -0.6460776 -0.4381069 -0.1250044 0.0768743 -0.1102407 -0.7835112 0.2135539 0.1230416 0.2605517 -0.4174243 unknown
polarizability: 75.6148252|2.8101809|47.320135|5.0182486|-0.9758646|48.4186617 unknown
InChI: InChI=1/3C.3F.N.2O.7H
charge 1 multiplicity 1
16 atoms
C  0.42011502 -0.34502945 -0.07440654
N  1.39907153 0.46708035 -0.07082471
O  2.4676529 -0.11005855 0.813246
H  3.38624564 -0.07403577 0.23839922
H  2.5449056 0.50851366 1.56210846
C  -0.77215982 0.01830945 -0.89995784
H  -0.90654445 -0.73816902 -1.6802931
H  -0.64851951 0.99790977 -1.36521232
H  0.42910352 -1.27195301 0.50039692
O  4.54650345 -0.01069964 -0.45782224
H  4.68857702 0.61130705 -1.18098534
H  5.15982778 -0.74983379 -0.54382881
C  -2.03247076 0.02626866 -0.03816468
F  -3.09887289 0.32922321 -0.77270177
F  -1.9228533 0.92567617 0.95296084
F  -2.22915539 -1.1781072 0.52735124
