program: Gaussian 09
title: opt freq
version: EM64L-G09RevD.01
method: RwB97XD
basis: 6-31+G(d,p)
operation: Freq
keyword: #P
keyword: Geom=AllCheck
keyword: Guess=TCheck
keyword: SCRF=Check
keyword: GenChk
keyword: RwB97XD/6-31+G(d,p)
keyword: Freq
converged: YES YES NO YES
title: Mulliken charges:
elementType: C N O H H C H H O H H C H H C C H H H C H H F
charge: 0.120104 -0.281123 -0.228694 0.567401 0.357906 -0.453190 0.216226 0.219502 -0.764967 0.425608 0.429883 -0.356585 0.218421 0.230164 -0.111675 -0.293553 0.206275 0.210098 0.191353 0.049348 0.156169 0.178486 -0.287156
chargesum: 1.00000
title: Mulliken charges with hydrogens summed into heavy atoms:
elementType: C N O C O C C C C F
charge: 0.120104 -0.281123 0.696613 -0.017462 0.090524 0.092000 0.094599 0.107898 0.384002 -0.287156
polarizability: 8.86810341e+01 4.15117768e+00 1.08783213e+02 1.71299424e+00 4.95789372e+00 6.87868681e+01
1716.lowfreq: -21.9190 -9.9616 0.0009 0.0011 0.0011 5.4683 42.6385 54.0687 67.1907
frequency: 42.1590 53.8362 67.1142 82.1824 102.8040 108.3121 144.3956 170.9712 226.4057 272.5434 319.8280 339.8536 358.1873 367.8509 429.8163 442.8429 506.3707 581.1446 627.3544 711.6613 736.6668 813.7302 845.4583 872.7667 943.3132 953.0118 1018.0427 1047.1873 1051.2252 1080.4361 1104.1019 1136.5257 1196.0944 1225.2319 1243.1493 1269.1737 1311.5772 1321.7759 1347.2363 1364.0569 1439.6074 1465.3158 1466.9574 1482.7008 1499.0934 1538.4799 1635.8409 1677.4254 1720.0589 1743.2833 2270.7763 3076.8925 3081.5821 3091.8799 3138.8913 3147.6378 3171.9939 3176.7152 3203.7790 3262.7255 3281.8319 3860.7187 3968.2569
redmass: 5.2399 3.0907 3.2427 3.3456 2.0805 1.2886 2.7655 3.9903 3.4939 2.6269 3.4761 3.6582 1.9917 2.1321 3.8242 1.9261 1.2988 2.6696 1.7649 2.9449 1.5815 1.4042 2.2309 2.4531 2.3012 1.7192 1.3323 1.2283 2.4740 1.5654 6.1401 1.8299 1.1869 1.7000 1.2318 1.5102 1.1521 1.2661 1.2496 1.8985 1.3104 1.1150 1.1552 1.1070 1.1024 1.0877 1.1041 1.2226 4.3027 4.0023 1.1043 1.0578 1.0630 1.0632 1.1087 1.1019 1.1042 1.0619 1.0931 1.0694 1.1163 1.0438 1.0852
irintensity: 1.8805 1.5862 7.8954 1.7310 3.5927 27.0863 5.4592 2.4855 3.8411 10.2551 18.9230 19.9099 45.6166 184.7388 231.9651 7.4806 14.6606 41.2848 16.7324 45.6855 23.2413 44.2859 83.7440 19.5642 23.3875 2.9786 51.9816 29.2431 37.9997 36.3593 102.3085 6.2555 72.4901 5.5167 0.9623 9.0876 6.3743 4.0369 0.5359 21.3118 38.8045 30.5766 42.3185 21.4318 4.4009 1.3541 48.2571 4.4512 9.1574 14.5095 4193.4521 20.5329 1.8573 2.3787 13.5639 0.0648 2.3603 0.9399 1.5779 761.5046 0.0853 92.0248 204.8005
temp: 298.150 k
press: 1.00000 atm
elementType: 6 7 8 1 1 6 1 1 8 1 1 6 1 1 6 6 1 1 1 6 1 1 9
symmnumber: 1
zpe: 509841.5 jmol-1
zpe.correction: 0.194188 hartree
zpe.thermalcorrener: 0.207307 hartree
zpe.thermalcorrenthalpy: 0.208252 hartree
zpe.thermalcorrgfe: 0.153482 hartree
zpe.sumelectzpe: -540.845838 hartree
zpe.sumelectthermal: -540.832719 hartree
zpe.sumelectthermalent: -540.831775 hartree
zpe.sumelectthermalfe: -540.886544 hartree
dipole: 1.1908 -8.3563 -0.6182
dipole: 8.4633
quadrupole: -33.8169 -35.7275 -54.1641
quadrupole: -15.1766 -0.3637 0.5604
quadrupole: 7.4193 5.5087 -12.9280 -15.1766 -0.3637 0.5604
hfenergy: -541.0400264 hartree
pointgroup: C01 [X(C6H13F1N1O2)]
dipole: 0.4784756 -3.2888422 -0.2477076 debye
dipolederiv: 0.4985252 0.018579 0.0731897 0.0074957 0.5102231 0.0885405 0.1354107 0.2213458 0.0798174 -0.3602874 0.4699817 0.100871 0.0546684 0.6753869 0.2551912 -0.0755183 0.3751879 -0.1141265 -1.0629586 -0.0212852 -0.1158556 0.4167879 -1.4160792 -0.1522678 0.1032802 -0.2593141 -0.2333155 1.2296906 -0.9912168 0.0664576 -0.827735 1.0079309 -0.0839345 0.20783 -0.2092025 0.305627 0.8905588 0.101449 -0.0783432 -0.008809 0.1023636 -0.0536411 -0.2249722 -0.0975984 0.2208834 -0.002436 0.0506209 -0.0080599 -0.0009626 -0.2353699 -0.0034986 -0.0144892 0.1592397 -0.0068365 0.0240264 -0.0217962 0.0715524 0.0045757 0.0289509 0.0049956 0.0532899 0.0080399 0.0431541 0.0021181 -0.0032843 -0.0463001 0.011732 0.0461368 0.0245014 -0.0221808 0.0106815 0.0667546 -0.85907 0.3731375 -0.0289134 0.3284514 -0.8771365 0.0626386 -0.1011704 0.1330041 -0.5487451 0.3371521 0.0055734 0.0144973 0.0052878 0.3470899 -0.0255489 0.0418505 -0.048642 0.3874573 0.3000529 0.0238817 -0.0167846 -0.0113347 0.4246679 0.0058231 -0.0457928 0.0377442 0.3646546 0.0102602 -0.0383602 -0.0398378 -0.2143751 -0.1040179 -0.026507 -0.0316678 -0.0377021 0.0461354 0.0664663 0.00433 0.0038971 0.0220377 -0.0209175 0.0003969 0.0438281 0.0087771 0.091835 0.028306 -0.0162476 0.0220222 -0.0206389 0.068306 -0.0545423 0.0206295 0.0001319 0.0059458 -0.363058 0.0506159 -0.0805703 0.2089094 0.2189459 0.0061567 -0.2006717 -0.0660747 0.088976 -0.2041796 0.1640337 0.0306124 0.158214 -0.1490641 -0.0109302 0.0923776 0.0111376 0.0814556 0.1411435 -0.0333755 -0.0020864 -0.0585716 0.035029 -0.0161918 0.0178261 0.0001087 -0.012256 0.1304333 -0.0571442 0.0159413 -0.0593799 0.0763032 0.0148832 0.0146957 0.0318477 0.0511621 0.1419421 -0.0280847 0.031281 -0.0241548 0.1083515 0.0331831 0.0178547 -0.0056605 -0.023853 0.4353776 0.1069381 0.0217394 0.1433499 1.1729399 0.105339 0.0257225 -0.0243735 0.4632109 -0.0928921 -0.024408 -0.0890629 -0.0046407 0.0151595 -0.0048691 -0.0484589 -0.0165414 0.0073671 -0.0128747 0.020225 0.0877505 0.0117368 -0.0140854 -0.0269937 0.0420833 -0.0109347 -0.0213624 -0.2782966 -0.1541633 -0.0339977 -0.1426446 -1.0211146 -0.1427244 -0.0517566 -0.2212024 -0.3439413 unknown
polarizability: 88.6810341|4.1511777|108.7832127|1.7129942|4.9578937|68.7868681 unknown
InChI: InChI=1/6C.F.N.2O.13H
charge 1 multiplicity 1
23 atoms
C  -0.02096882 0.42830598 0.10335054
N  0.92965368 -0.42987311 0.09165512
O  0.48408674 -1.72169326 -0.46491849
H  1.27081129 -2.39232536 -0.24346595
H  -0.39363851 -1.9966049 -0.07967576
C  0.38293214 1.7803199 0.61725636
H  -0.32685765 2.08028533 1.39647127
H  1.38082856 1.73360225 1.05775991
O  2.33347538 -3.25113059 0.09335198
H  3.02588677 -2.92056172 0.67777127
H  2.74244616 -3.82768226 -0.56232321
C  -1.44728682 0.16116884 -0.31961603
H  -2.03165671 1.07487075 -0.18107413
H  -1.46788656 -0.08217947 -1.38870632
C  -2.06226906 -0.95837444 0.49586671
C  -2.57080508 -2.07858878 -0.02739781
H  -2.09275996 -0.80550157 1.57335693
H  -3.02192236 -2.83516981 0.60607529
H  -2.59585325 -2.25111595 -1.10192627
C  0.36327321 2.83427105 -0.49448404
H  -0.61223647 2.90009946 -0.98800722
H  1.13707478 2.6334866 -1.2412446
F  0.62669358 4.05896614 0.08307522
