program: Gaussian 09
title: opt freq
version: EM64L-G09RevD.01
method: RwB97XD
basis: 6-31+G(d,p)
operation: Freq
keyword: #P
keyword: Geom=AllCheck
keyword: Guess=TCheck
keyword: SCRF=Check
keyword: GenChk
keyword: RwB97XD/6-31+G(d,p)
keyword: Freq
converged: YES YES NO YES
title: Mulliken charges:
elementType: C N O H H C H H O H H C H H C C C C H C H C H H F O C H H H
charge: -0.207271 -0.154015 -0.290799 0.564555 0.403400 -0.532006 0.201453 0.215018 -0.760733 0.425531 0.431103 0.047475 0.170049 0.168439 0.465411 -0.391069 -0.576366 0.152595 0.177416 0.568009 0.192080 -0.408292 0.201285 0.179704 -0.298026 -0.317578 -0.154774 0.164020 0.194254 0.169131
chargesum: 1.00000
title: Mulliken charges with hydrogens summed into heavy atoms:
elementType: C N O C O C C C C C C C F O C
charge: -0.207271 -0.154015 0.677156 -0.115535 0.095901 0.385963 0.465411 -0.213653 -0.384287 0.353880 0.747713 -0.408292 -0.298026 -0.317578 0.372632
polarizability: 1.86459503e+02 -1.03840482e+01 1.27924965e+02 7.91706360e-01 1.11206271e+01 1.09646036e+02
1716.lowfreq: -10.3802 -5.0266 -0.0007 -0.0005 0.0004 6.9294 30.9018 36.8846 46.5223
frequency: 30.6792 36.6549 46.4412 47.5963 79.3556 90.4183 107.6332 112.7059 142.6148 170.4598 200.6198 256.2813 269.9481 293.5782 314.6522 344.5722 352.6563 374.1317 425.0291 435.5206 448.9751 507.2187 526.1577 546.0955 567.1001 626.0394 654.8335 684.0318 701.7661 760.1053 797.8049 823.9773 846.2531 855.9443 876.1353 996.6571 1012.4370 1026.5429 1055.3711 1067.3272 1078.8130 1099.0321 1117.4545 1145.8402 1166.4027 1185.7095 1215.4612 1224.7399 1235.7031 1304.9617 1310.3967 1327.8132 1345.1181 1353.2453 1379.9960 1402.8279 1431.1740 1483.2159 1489.7584 1494.8903 1511.2353 1521.7840 1530.3960 1574.1500 1630.2902 1634.6991 1661.4273 1682.2132 1717.2779 2245.7308 3059.0956 3083.0147 3090.3414 3142.2786 3145.7238 3169.3262 3215.0974 3222.8544 3233.1851 3257.4588 3267.7119 3559.4315 3859.0377 3966.1693
redmass: 4.7333 5.5433 4.4648 3.9742 2.2053 1.8570 1.6471 4.4805 3.5086 4.9527 3.8182 1.3142 2.6489 3.6169 4.2424 3.2743 5.3352 1.5075 3.0460 3.6528 3.6683 1.3696 2.7260 2.7721 1.5446 4.0466 4.7296 4.5871 3.6299 5.4931 2.2297 1.8993 3.8304 1.3004 1.7309 1.2830 1.3341 2.9560 1.9668 2.4475 5.8622 7.0225 1.6019 2.0136 1.3668 1.2723 1.2899 1.2135 1.2159 1.4369 1.2693 2.2524 3.5261 1.5558 5.0894 1.0903 1.3597 3.0805 1.1066 1.2130 1.0545 1.0651 1.0870 2.8134 3.1876 1.3557 1.3294 4.7914 3.5653 1.1037 1.0341 1.0601 1.0602 1.1080 1.1087 1.1039 1.1021 1.0913 1.0905 1.0956 1.0929 1.0662 1.0439 1.0850
irintensity: 2.9834 0.8728 0.6216 1.9147 5.8610 11.3304 16.8014 4.1908 11.6256 0.7835 0.8898 1.1218 1.1037 13.4328 38.8812 14.3204 14.6768 199.7646 22.0842 6.7139 284.7422 44.6030 25.9269 28.9449 39.8535 5.3314 18.4339 18.9564 23.0454 38.0263 68.4884 29.6951 23.6706 7.0515 70.1842 1.2429 1.4433 0.5654 13.8494 37.9877 52.8655 122.3404 46.0160 49.5867 1.6264 1.0375 19.2226 64.7233 6.7270 30.4478 9.2223 42.8269 69.3581 2.2899 319.1019 70.0293 25.4345 9.3929 22.6816 5.0128 20.1740 51.2322 0.6302 161.5300 5.5401 86.1129 57.7612 350.0243 26.7970 4772.8705 33.7477 11.0987 10.1430 20.6430 11.7334 6.6678 5.6986 0.3842 1.5691 0.2646 1.2231 281.6873 102.0057 200.8032
temp: 298.150 k
press: 1.00000 atm
elementType: 6 7 8 1 1 6 1 1 8 1 1 6 1 1 6 6 6 6 1 6 1 6 1 1 9 8 6 1 1 1
symmnumber: 1
zpe: 647687.0 jmol-1
zpe.correction: 0.246691 hartree
zpe.thermalcorrener: 0.263578 hartree
zpe.thermalcorrenthalpy: 0.264522 hartree
zpe.thermalcorrgfe: 0.200030 hartree
zpe.sumelectzpe: -769.599269 hartree
zpe.sumelectthermal: -769.582382 hartree
zpe.sumelectthermalent: -769.581438 hartree
zpe.sumelectthermalfe: -769.645930 hartree
dipole: 2.1185 -10.0538 0.0146
dipole: 10.2746
quadrupole: -44.3176 -47.6443 -80.3748
quadrupole: -30.0337 10.0850 0.8756
quadrupole: 13.1280 9.8012 -22.9292 -30.0337 10.0850 0.8756
hfenergy: -769.8459599 hartree
pointgroup: C01 [X(C10H15F1N1O3)]
dipole: 0.7956164 -3.875823 0.1317775 debye
polarizability: 186.4595026|-10.3840482|127.9249654|0.7917064|11.1206271|109.6460361 unknown
InChI: InChI=1/10C.F.N.3O.15H
charge 1 multiplicity 1
30 atoms
C  1.58781204 -0.08943156 -0.05963783
N  2.24023555 -1.17437322 -0.27997827
O  1.34225647 -2.34752158 -0.34499983
H  1.90991428 -3.15336102 0.04331069
H  0.49800188 -2.17418476 0.12858685
C  2.46653483 1.1253467 0.05892282
H  2.32054 1.56505337 1.05206709
H  3.51591038 0.83636932 -0.03155414
O  2.70708485 -4.17862406 0.57311233
H  3.58627011 -3.9469172 0.89550023
H  2.76269077 -5.03816443 0.13966711
C  2.12152339 2.17730636 -0.99633925
H  1.08347285 2.51163266 -0.90965673
H  2.30410815 1.79994413 -2.00719107
C  0.12089429 0.02946872 0.0766296
C  -0.43118456 0.69406508 1.18956449
C  -0.74029361 -0.43437734 -0.92894282
C  -1.79545682 0.85183247 1.30477619
H  0.2132846 1.07537703 1.97547796
C  -2.11619165 -0.26036519 -0.83015218
H  -0.3344369 -0.89946673 -1.82328793
C  -2.65446606 0.3795873 0.29470014
H  -2.23226018 1.34733963 2.16426397
H  -2.75144392 -0.61029713 -1.63404817
F  2.94282382 3.26875355 -0.78922686
O  -3.95585571 0.59424799 0.49698171
C  -4.89782755 0.17204558 -0.48437816
H  -4.85792031 -0.91346526 -0.62164766
H  -5.87270391 0.45373557 -0.09206534
H  -4.72395442 0.6825326 -1.43703653
