program: Gaussian 09
title: 000052714
version: EM64L-G09RevD.01
frameworkgroup: C1[X(C19H19ClF3NO2)]
method: RPBEPBE
basis: SDD
operation: Freq
keyword: #p
keyword: freq=noraman
keyword: PBEPBE/SDD
title: #p freq=noraman PBEPBE/SDD
converged: YES YES NO NO
title: Mulliken charges:
elementType: Cl F F F O O N C C C C C C C C C C C C C C C C C C C H H H H H H H H H H H H H H H H H H H
charge: -0.052397 -0.165021 -0.167964 -0.171269 -0.278879 -0.259738 -0.300297 -0.042723 -0.622123 0.563663 -0.708708 -0.373456 -0.464470 -0.434065 -0.248782 0.290581 -0.210823 -0.364614 0.250739 0.209457 0.233341 -0.333752 -0.320922 -0.203403 -0.193959 -0.096093 0.222532 0.205564 0.214542 0.241097 0.218708 0.209100 0.230153 0.223965 0.190085 0.258681 0.237491 0.220453 0.229249 0.234673 0.263428 0.274279 0.277973 0.259136 0.254565
chargesum: 0.00000
title: Mulliken charges with hydrogens summed into heavy atoms:
elementType: Cl F F F O O N C C C C C C C C C C C C C C C C C C C
charge: -0.052397 -0.165021 -0.167964 -0.171269 -0.278879 -0.259738 -0.059200 0.179809 -0.202016 0.563663 -0.050747 0.040594 -0.205789 -0.196574 0.200919 0.290581 0.023851 -0.101186 0.250739 0.209457 0.233341 -0.059473 -0.042949 0.055733 0.060606 -0.096093
polarizability: 2.95724206e+02 -4.19271636e+01 2.02089747e+02 1.04858378e+01 4.59642713e+01 1.81810231e+02
1716.lowfreq: -11.0013 -4.8629 -1.6580 -0.0019 -0.0016 -0.0015 3.8803 9.3404 17.3306
frequency: -10.4389 9.0633 16.9650 24.3554 27.1345 36.1234 57.6975 68.8373 83.9130 85.7338 109.0421 129.6706 153.7711 161.5998 190.0449 211.7552 225.2043 231.7048 251.2012 268.0534 278.7777 286.5853 299.6571 304.4384 328.0851 330.7201 380.0330 406.2732 408.6638 426.4005 439.5194 454.3642 470.5867 473.3439 503.2684 517.4843 519.9935 567.9726 605.5796 609.2440 622.3574 637.9850 668.1944 696.3226 699.7144 708.2262 737.3416 789.9541 806.0654 827.5843 834.8943 844.8490 850.2599 852.2024 888.1491 898.8285 909.8583 931.8317 951.1163 974.0189 977.0717 986.2176 988.3444 988.9176 991.0023 999.9923 1008.2144 1037.5374 1052.2789 1063.1084 1067.0022 1069.7454 1096.9031 1106.8832 1115.8237 1121.5062 1155.5162 1175.4733 1185.5549 1186.4863 1199.5653 1238.8935 1243.0374 1268.5063 1278.2367 1288.2910 1296.4489 1313.3526 1323.7840 1334.0620 1362.5674 1376.2033 1378.4136 1382.2852 1390.7921 1396.0911 1437.2067 1446.2044 1461.1772 1466.4506 1468.0449 1472.2694 1474.7489 1479.5548 1481.1368 1578.4587 1599.1101 1599.4744 1617.9591 1620.1859 2877.7383 2966.7948 2974.9592 2990.6486 3001.7543 3034.0288 3043.3655 3064.5161 3068.9808 3072.3420 3121.9736 3148.1819 3157.5469 3162.7303 3169.0271 3172.9845 3177.7473 3184.8108 3430.6239
redmass: 6.5144 6.3442 5.5325 10.4170 9.4482 9.7025 5.6747 4.4724 5.8060 5.8673 5.3302 6.5477 4.3162 5.7899 2.8550 3.5024 1.7050 1.7954 3.3052 4.8659 6.7904 4.2660 6.2426 6.4795 5.1485 3.4429 5.3607 2.8347 2.8922 4.0181 2.8611 4.2114 3.6165 3.3550 4.8610 7.9149 4.5331 4.3115 1.7829 8.6904 7.1267 5.9909 4.7672 3.7504 7.3058 2.6254 3.7266 3.7987 1.6406 2.2274 1.2827 2.4285 1.6295 3.0290 2.3011 1.6772 1.6422 1.4044 1.9311 1.5912 4.4152 1.3672 2.7778 2.1850 2.2288 4.2176 6.2405 2.8868 2.2295 3.0315 3.9734 3.0111 1.9311 1.3841 1.8919 1.7574 2.2543 1.1230 1.1771 1.2938 1.8162 1.3634 3.2564 1.2816 1.4691 1.2482 2.3492 1.2991 1.5719 1.2803 1.3999 1.2956 5.0258 1.3872 6.7862 4.2436 3.0069 1.1836 1.0735 1.0918 1.1147 2.2923 1.0759 2.2926 1.1614 8.5056 6.3396 6.1356 6.3386 10.9404 1.0707 1.0364 1.0662 1.0799 1.0585 1.0886 1.0991 1.0995 1.1052 1.0994 1.0887 1.0913 1.0890 1.0894 1.0960 1.0943 1.0968 1.0970 1.0740
irintensity: 0.0993 0.0881 0.0558 0.2948 0.1150 0.5830 0.1778 0.0220 0.5068 0.2059 1.9447 0.1591 0.4665 1.9481 3.3844 5.1982 3.5544 0.3414 1.6335 5.0494 2.1534 0.6181 2.6265 0.9382 2.0272 3.6688 1.3977 4.4328 0.0325 2.6892 4.2675 4.4275 23.7570 3.8526 20.9768 2.0625 1.0245 24.0543 98.7065 3.7400 1.7914 3.7040 25.7603 8.5167 12.7528 29.0633 29.0566 9.5687 74.3931 1.2155 3.9052 19.3255 47.0635 2.4833 14.7990 11.4806 15.7042 14.4712 1.6453 50.3321 181.5715 0.3901 21.9206 16.1633 4.2148 55.8185 130.5835 52.6809 14.3024 68.6582 230.6916 23.4067 30.1369 6.1282 2.2487 2.2950 68.0676 30.7250 10.9375 18.3448 67.4750 18.4905 292.3769 9.1397 48.4428 0.6631 148.5986 11.5065 33.1261 20.3783 9.6182 11.6432 7.3547 5.6191 1.2140 15.9546 25.6502 37.2302 4.4000 10.4598 3.8433 36.5010 12.4624 9.0819 4.9455 13.8639 84.0403 3.6610 8.5673 210.9902 118.2794 27.4223 21.5221 36.7484 37.6989 13.0906 11.8836 44.6004 35.4925 40.0453 9.9061 12.5038 0.0058 0.5978 9.3161 0.5121 4.1986 1.6814 0.1850
temp: 298.150 k
press: 1.00000 atm
elementType: 17 9 9 9 8 8 7 6 6 6 6 6 6 6 6 6 6 6 6 6 6 6 6 6 6 6 1 1 1 1 1 1 1 1 1 1 1 1 1 1 1 1 1 1 1
symmnumber: 1
zpe: 894504.4 jmol-1
zpe.correction: 0.340699 hartree
zpe.thermalcorrener: 0.365226 hartree
zpe.thermalcorrenthalpy: 0.366170 hartree
zpe.thermalcorrgfe: 0.282340 hartree
zpe.sumelectzpe: -1698.308681 hartree
zpe.sumelectthermal: -1698.284153 hartree
zpe.sumelectthermalent: -1698.283209 hartree
zpe.sumelectthermalfe: -1698.367040 hartree
dipole: -6.2480 0.0944 -3.7043
dipole: 7.2642
quadrupole: -141.5064 -159.3520 -160.6948
quadrupole: -2.7629 3.0977 5.9408
quadrupole: 12.3447 -5.5009 -6.8437 -2.7629 3.0977 5.9408
hfenergy: -1698.6493793 hartree
pointgroup: C01[X(C19H19Cl1F3N1O2)]
dipole: -2.3951914 1.0069318 -1.1903916 debye
polarizability: 260.0606506|-60.5791048|233.3796876|14.6800169|48.869384|186.1838448 unknown
InChI: InChI=1S/C19H19ClF3NO2/c1-13(11-14-3-2-4-16(12-14)19(21,22)23)24-9-10-26-18(25)15-5-7-17(20)8-6-15/h2-8,12-13,24H,9-11H2,1H3
charge 0 multiplicity 1
45 atoms
Cl 4.847332 -2.321713 -2.121389
F  1.368959 -2.547799 0.998421
F  0.567468 -0.756646 2.147706
F  -0.179013 -2.837892 2.624064
O  0.422182 2.38949 -0.035772
O  2.101415 2.848875 1.514613
N  -2.566652 2.258244 0.436386
C  -3.660075 1.747002 -0.419019
C  -4.073827 0.32155 0.063334
C  -2.99892 -0.729654 -0.150038
C  -4.901899 2.679095 -0.480533
C  -1.787166 3.405004 -0.063269
C  -1.919186 -0.862714 0.755904
C  -3.037768 -1.585611 -1.280753
C  -0.393949 3.475126 0.564847
C  -0.907825 -1.82313 0.529914
C  -2.022285 -2.542452 -1.509316
C  -0.949598 -2.669371 -0.602857
C  0.190156 -1.981822 1.540242
C  1.674158 2.17149 0.545863
C  2.416368 1.068855 -0.127653
C  3.716602 0.753596 0.34321
C  1.861677 0.337796 -1.209329
C  4.463879 -0.278153 -0.258799
C  2.59958 -0.696135 -1.820765
C  3.890102 -0.985489 -1.334509
H  -3.241827 1.650951 -1.441414
H  -4.993356 0.030567 -0.478415
H  -4.343827 0.38918 1.136983
H  -2.866772 2.380622 1.413813
H  -5.646329 2.313411 -1.212629
H  -5.39727 2.736415 0.508269
H  -4.611362 3.70348 -0.777223
H  -1.67056 3.294145 -1.157556
H  -2.27992 4.394091 0.106292
H  -1.856383 -0.20064 1.623655
H  -3.87188 -1.503266 -1.988791
H  0.096728 4.441792 0.342267
H  -0.416936 3.344694 1.662272
H  -2.070432 -3.193893 -2.388173
H  -0.157284 -3.40548 -0.770224
H  4.12501 1.322812 1.184232
H  0.854524 0.578656 -1.559009
H  5.465414 -0.530442 0.100016
H  2.179946 -1.267739 -2.653273
