program: Gaussian 09
title: opt freq
version: EM64L-G09RevD.01
method: RwB97XD
basis: 6-31+G(d,p)
operation: Freq
keyword: #P
keyword: Geom=AllCheck
keyword: Guess=TCheck
keyword: SCRF=Check
keyword: GenChk
keyword: RwB97XD/6-31+G(d,p)
keyword: Freq
converged: YES YES YES YES
title: Mulliken charges:
elementType: C N O H H C H H O H H C H H H C C C C H C H C H H H
charge: -0.304505 -0.119199 -0.422436 0.560207 0.452669 -0.290048 0.189059 0.201433 -0.779516 0.421338 0.429916 -0.520635 0.189876 0.195831 0.174220 0.556157 -0.244916 -0.106294 -0.169495 0.170662 -0.175420 0.152577 -0.123013 0.190020 0.182717 0.188793
chargesum: 1.00000
title: Mulliken charges with hydrogens summed into heavy atoms:
elementType: C N O C O C C C C C C C
charge: -0.304505 -0.119199 0.590441 0.100444 0.071738 0.039291 0.556157 -0.074254 0.046284 0.020525 0.007298 0.065781
polarizability: 1.40060213e+02 5.39385320e+00 1.21673148e+02 -3.41328472e-01 1.11506274e+01 9.59056800e+01
1716.lowfreq: -5.8869 -3.5930 -0.0004 0.0006 0.0007 12.1486 21.1752 47.9899 54.9560
frequency: 20.9035 47.9287 54.9030 80.6054 102.4749 152.5613 163.8592 194.2130 219.5332 259.6001 275.2648 302.2702 342.1612 411.8888 412.8295 456.3606 470.9825 502.3570 545.0592 579.3761 632.5644 690.6665 718.9030 732.6615 751.9463 802.7048 815.9571 880.7144 964.7757 980.1074 1017.5739 1022.8713 1049.7503 1054.9526 1069.4412 1089.3998 1112.1749 1129.8655 1143.5249 1204.6475 1225.2555 1273.1802 1295.7091 1345.0868 1355.2759 1372.7963 1381.2526 1436.0596 1482.4770 1498.3028 1503.6771 1511.4767 1545.1346 1624.2399 1659.3304 1680.9796 1681.6899 1708.1347 2558.1877 3078.9217 3084.0846 3151.0114 3167.9867 3182.4804 3214.1749 3230.3925 3238.3950 3247.3468 3255.7555 3805.2783 3867.7948 3978.3956
redmass: 4.8308 3.8193 3.3157 3.1041 3.2247 1.1190 1.7193 1.7742 4.3292 1.9061 1.4547 4.4246 3.0031 2.7001 2.9434 1.2778 3.5145 3.6823 1.9982 2.1293 6.1942 4.3695 4.2296 1.9212 4.3396 1.9532 1.3260 1.2425 1.3955 1.8977 1.3776 5.7479 1.3215 2.4440 1.8110 1.5942 1.4514 1.5802 2.0599 1.1328 1.1289 1.2146 4.0500 2.1665 1.8579 1.6764 1.0675 1.2117 1.0861 2.2397 1.0409 1.0566 2.2406 1.1058 5.1812 1.9666 5.0551 1.9116 1.0790 1.0417 1.0590 1.1005 1.1029 1.1036 1.0905 1.0884 1.0912 1.0953 1.0994 1.0666 1.0438 1.0854
irintensity: 1.8835 2.2221 1.4989 1.5838 1.5704 12.0398 1.4003 1.5154 0.8695 89.8883 222.6897 5.5196 29.4739 37.2627 27.8605 77.7454 6.6793 0.8984 30.7606 15.6540 0.5277 12.7898 98.6067 14.2976 10.4749 50.0362 14.8066 2.5838 3.5220 14.2505 1.7414 2.4835 0.7973 40.9086 26.0799 0.1616 23.9858 4.7170 25.1151 0.4162 1.0267 1.8131 27.2711 2.8416 1.8518 2.2699 57.6019 4.9053 13.3409 8.2141 13.3112 10.3231 3.3192 81.0532 8.8317 20.7117 11.6465 101.4984 2816.2832 6.0376 8.7171 2.0260 9.6027 10.5631 2.4376 0.8032 0.8392 4.3346 1.7952 267.6161 100.8589 193.0063
temp: 298.150 k
press: 1.00000 atm
elementType: 6 7 8 1 1 6 1 1 8 1 1 6 1 1 1 6 6 6 6 1 6 1 6 1 1 1
symmnumber: 1
zpe: 580790.6 jmol-1
zpe.correction: 0.221211 hartree
zpe.thermalcorrener: 0.235098 hartree
zpe.thermalcorrenthalpy: 0.236042 hartree
zpe.thermalcorrgfe: 0.179392 hartree
zpe.sumelectzpe: -555.919240 hartree
zpe.sumelectthermal: -555.905354 hartree
zpe.sumelectthermalent: -555.904410 hartree
zpe.sumelectthermalfe: -555.961060 hartree
dipole: 6.1938 -3.8277 0.3139
dipole: 7.2879
quadrupole: -31.0132 -44.2429 -60.7208
quadrupole: -15.9678 -3.5153 4.9698
quadrupole: 14.3124 1.0827 -15.3951 -15.9678 -3.5153 4.9698
hfenergy: -556.1404518 hartree
pointgroup: C01[X(C9H14N1O2)]
dipole: 2.4200691 -1.4989227 0.1353148 debye
dipolederiv: 0.9329185 0.15777 0.1802442 0.1407021 0.486998 -0.0937136 0.1563446 -0.0191516 0.1322825 -0.5811001 -0.069725 -0.0708379 -0.3386199 0.8822817 -0.278723 0.0996914 -0.2101574 -0.2026142 -0.4633388 0.2051474 0.1424866 0.6820349 -1.4045931 0.1987544 0.1636508 -0.0635216 -0.4884743 0.7834583 -0.4447331 -0.3272655 -0.4354807 0.5915604 0.3282076 -0.6408192 0.6618174 0.705301 0.3602166 -0.0277268 0.0298008 -0.0285111 0.2736029 -0.064047 0.103726 -0.1231369 0.4637839 -0.0303437 0.1256101 -0.0509057 0.0100192 0.0106153 -0.0020188 -0.0904283 0.0044199 0.0125815 0.0378975 0.0280029 0.0858784 0.034743 0.0308084 0.0328927 0.0462441 0.0327196 -0.0064878 -0.0221137 -0.0529732 -0.0558675 -0.044365 0.0499096 0.0064021 -0.0357663 0.0213201 0.0482279 -0.7495611 0.190981 0.0870291 0.1952597 -0.6477753 -0.0790879 0.2050409 -0.2165565 -0.7251679 0.3916247 0.0004311 0.0134399 0.015151 0.3112021 -0.0460361 0.0129302 -0.0369404 0.3453036 0.3341495 0.0067398 0.0430813 -0.0327556 0.3917929 -0.0007359 0.0544362 -0.0214114 0.3351457 0.0764323 -0.0452959 -0.0069084 0.0025301 -0.0603751 0.0510128 -0.0078819 -0.0889175 0.1059387 -0.0698993 -0.048582 -0.042094 -0.0561181 0.0811901 -0.0332697 -0.0183691 -0.0134128 0.0295815 0.0878036 0.0028022 -0.0104632 -0.0089334 -0.0832864 0.0391237 -0.0193182 0.0400317 0.0452979 -0.0065193 0.0506342 0.0714949 0.0775841 0.0541016 -0.0703803 0.035156 -0.008767 -0.0172047 -0.2654725 -0.1195443 -0.0890306 -0.2086147 -0.1514872 0.0169289 -0.0667098 0.0244192 -0.004378 0.06382 0.134972 0.058504 -0.1272462 -0.0351542 0.0594603 -0.0066211 0.0742276 -0.0369706 -0.0110037 -0.0346185 -0.0706049 0.1940602 -0.007467 0.0352451 0.0004093 0.0477784 -0.046348 0.0495919 -0.0801173 -0.1230878 -0.0584242 -0.1361088 0.0111017 -0.1210576 -0.0014899 -0.0632695 0.0909454 -0.025433 -0.0189418 -0.0112457 0.0258024 -0.088899 -0.0133629 -0.0836067 0.0715229 -0.1748189 0.0185147 0.0193051 -0.0118316 0.0162841 0.1168553 0.0234496 0.1199348 0.0028547 -0.0252903 0.0144543 0.0699663 0.002579 0.0885778 -0.0291423 0.0644839 -0.0326733 0.0770498 0.1058368 0.0636087 0.0093328 0.0672095 0.0072824 0.0542195 0.0031159 0.0660528 -0.0360552 0.0046001 0.0087426 0.0490276 0.0178309 0.1013565 -0.0443322 0.0464507 -0.0477932 0.084884 0.0741853 -0.005448 0.0140802 -0.0222982 0.0409543 -0.085184 0.0133393 -0.0895727 0.0565157 0.0059811 -0.0542136 -0.0076637 -0.0552593 0.0819266 -0.0346343 -0.0081346 -0.0356127 0.1106991 unknown
polarizability: 140.0602132|5.3938532|121.6731476|-0.3413285|11.1506274|95.90568 unknown
InChI: InChI=1/9C.N.2O.14H
charge 1 multiplicity 1
26 atoms
C  0.68758555 0.92548125 0.4420427
N  1.8347786 0.47831493 0.80272294
O  1.73014317 -1.02892433 1.08717247
H  2.28513697 -1.50148749 0.34658399
H  2.19225816 -1.12336802 1.93624543
C  0.70145912 2.41521811 0.20137918
H  -0.03455243 2.85126882 0.88707307
H  1.68064546 2.81774284 0.47125639
O  3.00535755 -2.09672525 -0.77341847
H  3.7996425 -1.69808212 -1.14619916
H  3.01133552 -3.03813158 -0.97793809
C  0.33788868 2.75731923 -1.24804935
H  -0.65654743 2.38762072 -1.50886726
H  0.34443192 3.84143423 -1.37619262
H  1.06308017 2.33106503 -1.94663102
C  -0.55795878 0.16092024 0.21846398
C  -1.72636209 0.54403906 0.88442106
C  -0.58892502 -0.88754501 -0.7075882
C  -2.91142959 -0.14517911 0.64909865
H  -1.71225201 1.36140547 1.59852797
C  -1.78372942 -1.55313355 -0.95730883
H  0.3073576 -1.15708636 -1.25872436
C  -2.94222743 -1.18877309 -0.27329569
H  -3.81345273 0.1406069 1.17888963
H  -1.81244854 -2.35159577 -1.69074026
H  -3.87247342 -1.71221384 -0.46603325
