program: Gaussian 09
title: 000052724
version: EM64L-G09RevD.01
frameworkgroup: C1[X(C23H22F3NO2)]
method: RPBEPBE
basis: SDD
operation: Freq
keyword: #p
keyword: freq=noraman
keyword: PBEPBE/SDD
title: #p freq=noraman PBEPBE/SDD
converged: YES YES NO NO
title: Mulliken charges:
elementType: F F F O O N C C C C C C C C C C C C C C C C C C C C C C C H H H H H H H H H H H H H H H H H H H H H H
charge: -0.162648 -0.166237 -0.173245 -0.278921 -0.261225 -0.299151 -0.039950 -0.623855 0.568127 -0.709248 -0.371562 -0.469312 -0.248093 -0.431183 0.285706 -0.222180 -0.348597 0.245578 0.233547 0.391720 0.387444 0.185856 -0.520408 -0.373099 -0.411456 -0.406123 -0.409466 -0.254508 -0.237773 0.221228 0.214512 0.203994 0.240337 0.230007 0.208958 0.217525 0.223075 0.187903 0.258133 0.218686 0.227674 0.236323 0.234141 0.268230 0.279574 0.269449 0.238919 0.243977 0.240238 0.228858 0.228521
chargesum: 0.00000
title: Mulliken charges with hydrogens summed into heavy atoms:
elementType: F F F O O N C C C C C C C C C C C C C C C C C C C C C C C
charge: -0.162648 -0.166237 -0.173245 -0.278921 -0.261225 -0.058814 0.181278 -0.205349 0.568127 -0.052758 0.039416 -0.211179 0.198266 -0.194860 0.285706 0.011962 -0.080367 0.245578 0.233547 0.391720 0.387444 0.185856 -0.240834 -0.103650 -0.172537 -0.162146 -0.169227 -0.025649 -0.009252
polarizability: 3.38231946e+02 -4.82443076e+01 2.51701863e+02 1.07215673e+01 6.39400269e+01 2.03676180e+02
1716.lowfreq: -15.0146 -4.7086 -4.5255 -0.0009 -0.0002 0.0005 5.7851 13.2479 20.8018
frequency: -10.5623 12.7927 19.9493 25.7707 29.7605 34.3029 54.6638 64.6937 80.9492 83.4082 107.5185 129.4958 151.5826 161.8511 185.2586 190.4751 210.7881 218.8453 229.3967 250.6686 264.5016 272.2928 301.6044 304.6242 329.0341 331.4849 349.9895 382.1775 394.1200 408.5158 427.2269 439.6269 463.4166 477.1147 486.3403 493.2988 511.0303 513.4725 518.2819 567.0399 591.9050 602.1030 609.3571 624.3728 631.9474 638.0332 696.3655 708.2086 716.3621 758.8658 765.1493 768.5908 789.1549 805.7514 815.5056 840.4430 844.5609 845.9683 879.4974 886.3707 889.1496 897.8955 910.1774 932.1717 936.8110 944.2308 951.1648 970.6397 975.0847 989.5175 989.9731 990.9089 992.3596 999.7467 1009.0532 1022.3778 1038.2210 1051.7208 1061.9699 1065.5467 1097.7506 1116.2365 1122.1609 1125.4681 1155.5779 1156.3976 1172.7045 1185.0310 1185.8493 1198.4730 1200.2750 1239.0282 1239.6669 1266.1481 1269.9273 1275.3826 1277.7520 1295.2933 1313.5332 1322.3589 1330.0054 1349.7707 1362.7491 1375.4966 1380.6662 1390.8954 1412.0001 1426.5798 1435.1182 1438.1566 1445.8196 1459.6431 1463.0647 1465.6865 1469.2072 1472.5669 1479.5433 1480.7038 1514.5659 1576.9028 1600.1127 1600.6312 1618.3495 1618.7015 1639.2160 2876.4483 2966.5194 2976.7708 2989.5471 3000.4075 3032.3888 3042.3948 3063.8030 3066.8396 3071.8354 3119.6586 3120.2884 3125.6467 3130.7806 3142.0339 3147.9125 3156.9551 3161.1041 3165.9492 3167.9642 3172.1705 3433.6059
redmass: 6.2608 5.6855 10.3560 6.9833 5.3442 8.2903 6.3263 4.6215 5.0632 4.4993 4.5895 6.5474 4.1851 5.3457 3.6747 2.6001 2.0009 1.9312 2.2014 3.6131 4.8030 4.0439 5.1546 6.1172 6.3349 3.4460 5.1968 5.0436 3.0980 2.6501 4.0239 2.9476 3.1218 2.5307 3.9500 3.8603 6.2210 3.8260 9.5186 4.2036 6.4935 1.7415 11.1001 3.8382 6.8448 5.9294 3.7122 2.6887 2.6201 4.8178 4.4016 1.7208 2.6706 1.6545 2.6040 1.9741 1.4681 2.2183 4.0720 1.6638 2.4589 1.7157 1.6500 1.4302 1.5658 4.4697 1.9518 1.4610 6.6986 3.1077 1.8794 2.3152 1.3461 1.3772 5.9340 2.3091 2.7899 2.2729 3.3120 3.5908 1.9506 1.9375 1.7495 1.7328 1.4103 1.8119 1.0775 1.2695 1.1680 1.7493 1.7497 1.3424 1.8586 1.3638 1.9173 1.6694 1.6224 2.4382 1.3143 1.5804 1.2799 1.8374 1.4093 1.3094 1.3254 7.2321 5.9639 2.8831 4.2615 3.0079 1.1891 1.0738 2.2836 1.0881 1.1242 1.0732 2.0614 1.2431 3.7978 7.6743 6.1815 6.3773 8.2037 6.9027 6.8629 1.0705 1.0359 1.0676 1.0777 1.0585 1.0887 1.1001 1.0995 1.1049 1.0994 1.0856 1.0886 1.0889 1.0889 1.0951 1.0918 1.0921 1.1003 1.0960 1.0929 1.0970 1.0741
irintensity: 0.1142 0.2673 0.0085 0.2582 0.2410 0.6086 1.2009 0.0766 0.2764 0.0778 0.7026 0.3622 0.5140 1.0763 0.6117 2.9326 1.0013 5.9639 0.1475 2.7416 2.4763 4.8765 0.8882 0.3506 2.4112 1.9352 9.4956 1.2767 0.0382 3.6564 2.9360 3.1916 6.6108 22.1120 6.4345 2.6894 0.4866 4.9519 0.7851 30.1829 8.9209 91.0642 6.0559 2.1451 0.4970 3.5971 9.2646 29.5149 4.5076 0.7591 7.9646 74.1928 8.6576 72.2514 2.6692 7.0828 20.2593 18.2034 0.6572 31.4893 13.0077 14.1504 16.3054 28.1274 5.9622 24.7906 2.4304 37.0586 198.3509 8.3201 11.5817 11.5406 1.6282 0.8893 100.4163 2.6714 44.5497 21.6857 173.3730 87.8809 28.6957 1.3372 1.5172 64.4243 21.5040 48.0926 0.4208 22.3544 4.3459 72.4360 210.3120 7.4732 13.6202 12.0154 36.9146 12.5647 94.4298 144.0460 15.0050 34.3226 20.7713 11.8330 7.7724 12.4719 6.7406 1.0459 8.8247 2.2092 0.5037 25.4457 32.0921 5.3892 14.9442 7.0345 3.6899 12.1508 8.5180 3.7572 1.0920 32.3872 4.8760 22.3265 177.5030 36.1290 30.7393 123.2579 31.0288 16.7927 42.0908 42.6839 13.7370 11.2740 41.8855 38.7376 38.7045 5.2166 9.8000 0.7475 8.6695 34.4459 12.6369 3.5884 34.4245 7.2461 5.4881 3.0893 0.1579
temp: 298.150 k
press: 1.00000 atm
elementType: 9 9 9 8 8 7 6 6 6 6 6 6 6 6 6 6 6 6 6 6 6 6 6 6 6 6 6 6 6 1 1 1 1 1 1 1 1 1 1 1 1 1 1 1 1 1 1 1 1 1 1
symmnumber: 1
zpe: 1041150.6 jmol-1
zpe.correction: 0.396553 hartree
zpe.thermalcorrener: 0.422406 hartree
zpe.thermalcorrenthalpy: 0.423350 hartree
zpe.thermalcorrgfe: 0.337775 hartree
zpe.sumelectzpe: -1392.305567 hartree
zpe.sumelectthermal: -1392.279714 hartree
zpe.sumelectthermalent: -1392.278770 hartree
zpe.sumelectthermalfe: -1392.364345 hartree
dipole: -3.8405 -2.0070 -4.5499
dipole: 6.2833
quadrupole: -133.7182 -170.8516 -173.5881
quadrupole: -6.2039 0.9777 7.7647
quadrupole: 25.6678 -11.4656 -14.2022 -6.2039 0.9777 7.7647
hfenergy: -1392.7021202 hartree
pointgroup: C01 [X(C23H22F3N1O2)]
dipole: -1.6416411 0.3311164 1.8183215 debye
polarizability: 317.8456848|62.1047888|260.7210814|-16.2189512|66.389684|215.0432228 unknown
InChI: InChI=1S/C23H22F3NO2/c1-16(13-17-5-4-8-21(14-17)23(24,25)26)27-11-12-29-22(28)20-10-9-18-6-2-3-7-19(18)15-20/h2-10,14-16,27H,11-13H2,1H3
charge 0 multiplicity 1
51 atoms
F  1.403342 1.807088 -1.819826
F  0.0278 0.179444 -2.613065
F  -0.274384 2.329044 -3.246644
O  -0.591372 -2.589704 0.095596
O  0.676116 -3.654804 -1.544508
N  -3.489436 -1.72642 -0.094618
C  -4.297851 -0.841501 0.771466
C  -4.387383 0.577016 0.127125
C  -3.054902 1.30392 0.085889
C  -5.71844 -1.387999 1.084443
C  -2.959579 -2.966407 0.499975
C  -2.128412 1.072232 -0.958158
C  -1.725841 -3.484498 -0.242604
C  -2.694051 2.207772 1.118498
C  -0.875457 1.726143 -0.963263
C  -1.436805 2.85383 1.117717
C  -0.517963 2.619011 0.0737
C  0.054259 1.509394 -2.121023
C  1.654634 -1.824075 -0.259936
C  2.520501 0.058403 1.066003
C  3.800575 -0.063071 0.395896
C  0.576403 -2.773122 -0.653136
C  1.462107 -0.83714 0.71617
C  2.92203 -1.942726 -0.924815
C  3.966567 -1.081859 -0.601908
C  2.349143 1.077369 2.062017
C  4.857155 0.837983 0.749723
C  3.397762 1.940186 2.387506
C  4.662024 1.819616 1.724957
H  -3.741917 -0.743107 1.725892
H  -4.801963 0.465449 -0.895288
H  -5.1201 1.170606 0.705935
H  -3.933057 -1.883957 -1.010237
H  -5.662983 -2.407673 1.507622
H  -6.332973 -1.432845 0.164174
H  -6.247052 -0.746722 1.814774
H  -2.670965 -2.752168 1.54602
H  -3.70171 -3.801841 0.537624
H  -2.376717 0.364127 -1.753639
H  -1.468577 -4.511225 0.080889
H  -1.865162 -3.494166 -1.339341
H  -3.404736 2.406362 1.930619
H  -1.175518 3.547416 1.923959
H  0.460059 3.109708 0.065687
H  0.487854 -0.748648 1.207094
H  3.033236 -2.719554 -1.687743
H  4.932518 -1.171201 -1.112507
H  1.378291 1.165975 2.564643
H  5.824408 0.747358 0.241178
H  3.260157 2.713087 3.151746
H  5.476668 2.503592 1.987723
