program: Gaussian 09
title: opt freq
version: EM64L-G09RevD.01
method: RwB97XD
basis: 6-31+G(d,p)
operation: Freq
keyword: #P
keyword: Geom=AllCheck
keyword: Guess=TCheck
keyword: SCRF=Check
keyword: GenChk
keyword: RwB97XD/6-31+G(d,p)
keyword: Freq
converged: YES YES NO YES
title: Mulliken charges:
elementType: C N O H H C H H C H H C F F F C H H H
charge: -0.008924 -0.081558 -0.324193 0.476636 0.468887 -0.208642 0.220546 0.219729 -0.436155 0.248300 0.255474 0.908231 -0.239613 -0.236009 -0.360486 -0.484703 0.168109 0.218094 0.196276
chargesum: 1.00000
title: Mulliken charges with hydrogens summed into heavy atoms:
elementType: C N O C C C F F F C
charge: -0.008924 -0.081558 0.621330 0.231633 0.067619 0.908231 -0.239613 -0.236009 -0.360486 0.097776
polarizability: 7.94646041e+01 -7.23514230e+00 7.56235136e+01 1.35858800e-01 2.97944139e+00 5.72120787e+01
1716.lowfreq: -17.8268 -12.2517 0.0008 0.0009 0.0011 11.1004 51.8149 67.3269 107.0032
frequency: 51.8064 67.2953 106.9710 185.3986 192.4202 212.9300 246.8184 304.8829 324.7460 366.0120 392.1626 411.6606 470.3869 526.3663 540.9555 565.9241 666.7001 719.5480 804.1921 835.4669 844.8130 918.0220 945.3569 989.1394 1054.5278 1077.1873 1100.1109 1131.3132 1201.7528 1243.1454 1277.5072 1293.3671 1325.2640 1357.5299 1402.4508 1432.8867 1484.4883 1492.8055 1505.4539 1509.6689 1614.9285 1731.2991 3083.0571 3089.7299 3122.1023 3155.8923 3174.2517 3183.6424 3189.7656 3509.7806 3782.8564
redmass: 7.2428 3.0322 2.9657 3.4345 1.4893 3.6772 4.4675 2.5667 2.6341 1.9126 3.4638 3.2744 3.3806 8.2950 10.7969 6.8913 5.4804 4.3867 1.2847 4.6305 2.7688 1.3972 1.7721 2.0438 2.1884 1.6893 1.4821 1.5702 2.7734 2.5668 1.3992 3.6239 2.0353 1.4210 2.2808 1.2026 1.0817 1.0860 1.0424 1.0670 1.0996 7.4364 1.0387 1.0606 1.0626 1.1032 1.1037 1.1034 1.1053 1.0576 1.0741
irintensity: 1.6816 1.7524 3.0972 21.9565 1.5316 17.4674 5.5490 39.0822 43.5815 25.9664 11.4080 9.5045 67.8758 2.4817 2.2151 26.7261 79.9201 12.1160 6.0239 48.4927 27.0262 89.0853 91.1305 4.6819 37.8923 4.4396 104.5132 17.0698 88.7630 132.3349 38.6248 90.3953 113.8085 15.5173 177.2886 4.0848 20.2591 0.7394 20.1159 15.4173 103.5680 15.2615 7.1136 3.7110 3.6296 3.7466 7.2342 1.6439 4.0135 424.2558 430.0292
temp: 298.150 k
press: 1.00000 atm
elementType: 6 7 8 1 1 6 1 1 6 1 1 6 9 9 9 6 1 1 1
symmnumber: 1
zpe: 390082.7 jmol-1
zpe.correction: 0.148575 hartree
zpe.thermalcorrener: 0.159333 hartree
zpe.thermalcorrenthalpy: 0.160277 hartree
zpe.thermalcorrgfe: 0.111956 hartree
zpe.sumelectzpe: -624.823702 hartree
zpe.sumelectthermal: -624.812944 hartree
zpe.sumelectthermalent: -624.812000 hartree
zpe.sumelectthermalfe: -624.860321 hartree
dipole: 4.4024 2.5101 -1.5180
dipole: 5.2902
quadrupole: -32.3361 -46.5931 -54.1088
quadrupole: -6.5061 -0.4377 0.9140
quadrupole: 12.0099 -2.2471 -9.7628 -6.5061 -0.4377 0.9140
hfenergy: -624.9722767 hartree
pointgroup: C01 [X(C5H9F3N1O1)]
dipole: 1.7287662 1.0205383 -0.6350751 debye
dipolederiv: 0.3775285 0.0129238 0.0343996 0.0216475 0.3660243 0.0768419 0.0491658 0.1816841 0.1121601 0.3408169 -0.4853989 -0.1888827 -0.7818726 0.4441523 0.2772745 -0.4204882 0.3038509 -0.0466014 -0.8708529 0.2985756 0.136612 0.6803227 -0.9283433 -0.1971489 0.4181963 -0.2366472 -0.2693763 0.643551 -0.0278207 -0.0332409 0.073716 0.2778224 -0.0247588 -0.0279647 -0.016352 0.3706839 0.3917161 0.2261355 0.0008582 0.0918039 0.597611 -0.0646559 0.0049261 -0.1387478 0.3003706 -0.0791409 0.0570829 0.0070628 -0.0448344 0.0590627 0.0187456 -0.1121874 0.067345 0.0310287 0.037366 -0.0178884 0.0321005 0.0255141 -0.010606 0.048352 0.0192154 0.0369643 0.0796528 0.0355382 -0.0081757 -0.067044 -0.0060682 0.0563465 -0.0153342 -0.0410506 -0.0082355 0.0576635 -0.0337417 0.0174388 0.0071307 -0.0656911 -0.2639783 0.0087175 0.0357841 0.0414155 -0.0437063 0.0591028 -0.0025527 -0.0041764 0.0185003 0.1018604 0.0258087 0.0002235 -0.0038602 0.1116963 0.059152 -0.0160547 0.0419035 -0.0176316 0.053256 -0.009514 0.009853 -0.0167508 0.1031581 1.6409856 0.1595592 -0.0007682 0.1415331 1.7705847 0.1076674 -0.0706046 0.0109646 1.5030482 -0.4025973 -0.2584587 -0.1463751 -0.3064104 -0.7490432 -0.2620792 -0.1283832 -0.1898054 -0.4078991 -0.4180728 0.0066188 0.2434614 -0.010749 -0.363614 -0.0068515 0.297979 -0.0292138 -0.6978865 -0.8921537 0.0266825 -0.1064488 0.1519395 -0.5112056 0.0977599 -0.139678 0.1274221 -0.3406891 0.0439401 0.0582015 0.0256143 0.0570342 0.0218805 -0.0291333 0.1593177 -0.1613789 0.0661739 0.0353063 -0.0555018 -0.06413 -0.0906334 -0.0013338 -0.0718233 -0.0697265 -0.0217782 -0.0027589 0.0542863 0.0664131 0.0166324 0.074002 0.0127606 -0.0164673 -0.0020697 -0.0069922 0.0466437 -0.0227305 -0.0577799 0.0652905 -0.0121227 0.0667628 0.036599 0.017492 0.0601155 0.0266381 unknown
polarizability: 79.4646041|-7.2351423|75.6235136|0.1358588|2.9794414|57.2120787 unknown
InChI: InChI=1/5C.3F.N.O.9H
charge 1 multiplicity 1
19 atoms
C  0.28936461 0.97309576 0.011513
N  1.53430828 1.10325279 0.25203356
O  2.32782238 -0.0675016 -0.42145588
H  3.25844909 0.16208873 -0.24858468
H  2.09129074 -0.91778677 0.02226988
C  -0.53204097 2.09391161 0.59820908
H  -1.33007034 1.62527384 1.18534997
H  0.08933907 2.67821876 1.28031936
C  -0.38066667 -0.13663002 -0.76119187
H  -1.38314412 0.17891622 -1.05540103
H  0.17935236 -0.3851423 -1.66675349
C  -0.53704235 -1.40074142 0.07727924
F  -1.13355272 -2.35994253 -0.60595168
F  -1.20154919 -1.17442886 1.20598444
F  0.70538453 -1.88577557 0.45152638
C  -1.11546039 2.99393453 -0.50163534
H  -1.77289931 2.45051825 -1.18551206
H  -1.71002944 3.7786399 -0.03053166
H  -0.32177965 3.47186558 -1.0803957
