program: Gaussian 09
title: opt freq
version: EM64L-G09RevD.01
method: RwB97XD
basis: 6-31+G(d,p)
operation: Freq
keyword: #P
keyword: Geom=AllCheck
keyword: Guess=TCheck
keyword: SCRF=Check
keyword: GenChk
keyword: RwB97XD/6-31+G(d,p)
keyword: Freq
converged: YES YES NO NO
title: Mulliken charges:
elementType: C N O H H C H H O H H C H H C H H H C H H H
charge: 0.017292 -0.186870 -0.418065 0.564218 0.451294 -0.243872 0.199887 0.205054 -0.774266 0.424218 0.431847 -0.164895 0.191697 0.196298 -0.517078 0.185268 0.206746 0.162770 -0.486646 0.170612 0.204375 0.180114
chargesum: 1.00000
title: Mulliken charges with hydrogens summed into heavy atoms:
elementType: C N O C O C C C
charge: 0.017292 -0.186870 0.597447 0.161070 0.081799 0.223100 0.037706 0.068455
polarizability: 9.02619179e+01 -3.22880736e+00 7.85417087e+01 1.98404741e+00 7.63245641e-01 6.39128693e+01
1716.lowfreq: -19.1452 -9.6211 -0.0008 0.0006 0.0007 8.9173 21.9242 51.8618 67.2101
frequency: 21.4565 51.7613 66.6897 85.5528 127.2496 174.7046 203.4410 219.9124 224.4896 247.5074 280.1340 347.3591 369.3937 423.4663 452.4550 522.6605 584.1999 687.1759 727.5314 775.8969 807.9163 831.0962 966.7615 1007.9460 1050.0863 1064.0908 1090.1457 1111.2036 1131.0519 1241.3328 1277.7691 1309.8707 1350.3244 1356.1790 1426.2762 1431.7739 1439.9680 1491.0039 1500.9955 1510.9621 1512.4757 1515.1834 1519.1608 1630.5989 1673.5133 1713.0997 2413.5287 3080.1760 3082.6830 3085.2131 3117.6849 3151.2290 3161.3507 3170.1697 3177.6384 3180.5443 3182.9159 3796.9373 3871.3004 3983.0065
redmass: 4.2049 3.2835 2.4116 2.5343 1.0459 2.1650 1.0875 1.3637 1.3959 2.2377 3.4984 2.8071 2.3913 2.2612 1.2915 2.3337 1.6074 5.3211 3.7894 1.8590 1.3164 1.4276 1.9065 2.4554 1.3910 1.7868 1.3467 1.6974 1.5837 2.0550 1.1977 1.3190 1.3814 1.6227 1.0779 1.1987 1.2075 1.0719 1.0467 1.0756 1.0435 1.0535 1.0867 1.1066 1.2017 4.0229 1.0832 1.0410 1.0357 1.0590 1.0609 1.1019 1.1042 1.1040 1.1026 1.1038 1.1048 1.0661 1.0436 1.0858
irintensity: 0.9501 1.2733 1.1670 1.1424 16.4612 4.7915 0.1000 138.3420 78.5293 34.4517 63.4223 7.1404 79.0854 69.8330 89.6827 39.0783 12.2688 43.4202 79.4642 0.4491 4.0934 9.7454 7.9151 2.5522 9.5613 31.5639 62.8972 0.7233 3.0309 1.8761 1.1102 2.8553 3.7571 7.3224 74.9898 2.9161 13.1833 7.5560 5.2546 3.7309 0.6998 21.8204 21.7677 63.8080 34.5853 47.9689 3557.9527 6.4090 12.2339 8.2942 5.2125 1.4736 7.5889 11.4672 7.5529 8.2987 7.2605 228.5189 85.4182 210.1982
temp: 298.150 k
press: 1.00000 atm
elementType: 6 7 8 1 1 6 1 1 8 1 1 6 1 1 6 1 1 1 6 1 1 1
symmnumber: 1
zpe: 514443.3 jmol-1
zpe.correction: 0.195941 hartree
zpe.thermalcorrener: 0.208295 hartree
zpe.thermalcorrenthalpy: 0.209239 hartree
zpe.thermalcorrgfe: 0.156617 hartree
zpe.sumelectzpe: -403.572260 hartree
zpe.sumelectthermal: -403.559906 hartree
zpe.sumelectthermalent: -403.558962 hartree
zpe.sumelectthermalfe: -403.611584 hartree
dipole: 5.1019 -0.1216 -0.8086
dipole: 5.1670
quadrupole: -11.0415 -37.2638 -44.9714
quadrupole: 3.4381 -4.3815 -2.3820
quadrupole: 20.0508 -6.1716 -13.8792 3.4381 -4.3815 -2.3820
hfenergy: -403.7682009 hartree
pointgroup: C01 [X(C5H14N1O2)]
dipole: 2.0299148 -0.0353923 -0.3022495 debye
dipolederiv: 0.4803384 -0.0177636 0.1280118 0.0452966 0.4056711 0.1206701 0.1476129 0.2742938 0.1386659 0.4614161 -0.4667723 -0.1542826 -0.8001427 0.1006258 0.1136185 -0.3670473 0.0989978 -0.220427 -1.5643338 0.1387254 0.1620721 0.3713573 -0.7255161 0.0329181 0.4809187 -0.0598282 -0.2587906 1.4204917 0.4410434 -0.2866789 0.8308766 0.5112502 -0.2071967 -0.4543213 -0.1590588 0.3972962 0.3291876 -0.0009404 0.0597964 -0.0414633 0.4003197 -0.0587242 0.1451216 -0.0817211 0.3388958 -0.0390383 0.0579561 -0.005908 -0.0106009 0.0285436 0.0156337 -0.1376766 0.0488516 0.0298087 -0.0112007 -0.0386924 0.0234592 -0.0177631 -0.0204963 0.0563788 0.016267 0.0248117 0.0780124 0.0617574 -0.0080159 -0.0689702 -0.0000235 0.0342335 -0.0311099 -0.0341249 -0.0293903 -0.0036402 -1.0551367 -0.1303828 0.0565324 -0.2697349 -0.6068755 0.0725644 0.109282 0.0495138 -0.5812371 0.3628826 -0.0044506 0.0504295 0.0033676 0.3506522 0.0202386 0.0691843 0.0266937 0.3537182 0.3900223 -0.0474142 0.0091731 -0.0900588 0.3197214 0.0200006 -0.018474 0.0067144 0.3756208 0.0341183 -0.0132907 -0.0047612 -0.0884289 -0.1601014 -0.0708102 0.0535534 0.0175954 0.0906759 0.006527 0.0377271 -0.0552628 0.0285973 0.0439331 0.0603786 -0.0525079 0.0197903 0.0400764 -0.0127338 -0.0089749 0.0829569 -0.0098822 0.0356599 -0.0082435 0.0319194 -0.0201742 0.0263675 0.0837346 0.0005265 0.0044904 -0.0040339 0.114435 -0.0270496 -0.0820507 -0.150205 0.0152366 -0.0030942 0.0195087 0.0794069 0.0672459 0.0520417 -0.0358985 0.0805525 0.0130619 0.0062736 0.0790346 -0.0444392 -0.0242173 -0.0603535 -0.0254017 -0.0440246 -0.017474 -0.0481103 0.0260325 -0.0688051 0.0643929 -0.0911498 0.0076795 0.0368217 0.0321342 -0.0619454 0.0668721 0.0161506 0.0066919 0.0727599 0.0043946 0.0446636 0.0572079 -0.0129908 0.13254 -0.1058547 0.0870625 0.072353 -0.0357692 -0.039588 -0.0575728 0.0093367 -0.0928026 -0.0538287 -0.0329779 -0.0499324 0.0144725 0.0825983 0.0245371 0.0911702 0.0043892 0.0022903 0.0132844 -0.0059808 0.0506095 -0.0486854 -0.0983323 0.0455585 -0.040196 0.0335482 0.0420246 -0.0007852 0.0461047 0.0435243 unknown
polarizability: 90.2619179|-3.2288074|78.5417087|1.9840474|0.7632456|63.9128693 unknown
InChI: InChI=1/5C.N.2O.14H
charge 1 multiplicity 1
22 atoms
C  -0.61316842 0.06617712 0.19565016
N  0.52480802 0.29036577 0.73659936
O  1.5396229 -0.76102791 0.23802167
H  2.3642706 -0.18824562 -0.06271969
H  1.79504502 -1.24899438 1.03877808
C  -1.65418749 1.07336278 0.61762938
H  -2.54533555 0.50829431 0.91377285
H  -1.29993644 1.62342143 1.4922447
O  3.49428665 0.62047725 -0.41303599
H  3.57293309 1.53633259 -0.12407523
H  4.05073367 0.4901187 -1.18838821
C  -0.99540492 -1.0565715 -0.72362334
H  -1.84424392 -0.72471782 -1.32566636
H  -0.17439219 -1.29441427 -1.40206913
C  -1.39597828 -2.30399575 0.0855737
H  -2.20244011 -2.08445972 0.78973904
H  -1.74764646 -3.07831319 -0.59843167
H  -0.55025877 -2.70950711 0.64680717
C  -1.99309746 2.04260793 -0.52374429
H  -2.38433541 1.52686872 -1.40434963
H  -2.75798053 2.74334288 -0.18373358
H  -1.11402319 2.62062574 -0.81992085
