program: Gaussian 09
title: opt freq
version: EM64L-G09RevD.01
method: RwB97XD
basis: 6-31+G(d,p)
operation: Freq
keyword: #P
keyword: Geom=AllCheck
keyword: Guess=TCheck
keyword: SCRF=Check
keyword: GenChk
keyword: RwB97XD/6-31+G(d,p)
keyword: Freq
converged: YES YES YES YES
title: Mulliken charges:
elementType: C N O H H C H H H C H H H
charge: -0.059600 -0.072615 -0.354100 0.465371 0.464475 -0.232205 0.230221 0.223441 0.248780 -0.508985 0.217596 0.186055 0.191566
chargesum: 1.00000
title: Mulliken charges with hydrogens summed into heavy atoms:
elementType: C N O C C
charge: 0.189180 -0.072615 0.575746 0.221457 0.086232
polarizability: 6.82732115e+01 2.57079349e+00 3.80684028e+01 1.19689474e+00 -1.47208340e+00 3.84275937e+01
1716.lowfreq: -16.5456 -4.0969 -0.0005 0.0008 0.0010 19.8326 99.2711 175.2665 209.8226
frequency: 99.1562 175.1191 209.8130 217.1909 314.0300 396.0008 450.7764 616.7881 796.9728 891.5699 930.6382 954.4323 1028.3722 1050.9578 1107.4212 1163.1334 1270.5177 1299.7783 1365.0384 1440.9975 1480.3200 1508.8961 1514.2616 1649.6332 1687.3854 3080.4651 3083.3849 3155.7222 3175.7874 3180.0507 3190.3625 3700.2487 3799.7010
redmass: 2.3086 2.6599 1.3029 1.2921 2.0167 4.3198 3.2427 4.7765 1.2142 1.3197 1.1832 1.5041 2.0842 1.3036 1.7030 2.1259 1.2386 1.2791 1.3806 1.1959 1.0823 1.0566 1.0380 1.1342 5.3880 1.0538 1.0455 1.1022 1.1046 1.1034 1.0966 1.0436 1.0862
irintensity: 2.1766 0.8691 101.1859 2.9644 6.3315 40.2337 62.4267 64.4537 18.8483 206.2160 20.0282 29.2282 12.3778 6.2760 3.2384 5.6137 1.4350 3.0174 2.0363 3.0876 13.5113 11.8780 16.9366 121.2460 16.8025 2.2793 8.2924 2.2055 7.4128 2.0703 6.9877 368.8742 286.7868
temp: 298.150 k
press: 1.00000 atm
elementType: 6 7 8 1 1 6 1 1 1 6 1 1 1
symmnumber: 1
zpe: 298976.2 jmol-1
zpe.correction: 0.113874 hartree
zpe.thermalcorrener: 0.120646 hartree
zpe.thermalcorrenthalpy: 0.121590 hartree
zpe.thermalcorrgfe: 0.084027 hartree
zpe.sumelectzpe: -248.575173 hartree
zpe.sumelectthermal: -248.568401 hartree
zpe.sumelectthermalent: -248.567457 hartree
zpe.sumelectthermalfe: -248.605020 hartree
dipole: 5.1445 -0.6459 0.6543
dipole: 5.2260
quadrupole: 0.2275 -27.4706 -27.4085
quadrupole: 1.7099 1.8512 1.8427
quadrupole: 18.4447 -9.2534 -9.1913 1.7099 1.8512 1.8427
hfenergy: -248.6890471 hartree
pointgroup: C01 [X(C3H8N1O1)]
dipole: 2.0145664 -0.2518351 0.2555144 debye
dipolederiv: 0.3389267 0.0545547 0.0040832 0.0172623 0.1825747 -0.0280982 0.0857896 -0.0126438 0.1393187 1.0647893 -0.0663557 0.3293366 -0.2932625 -0.1056599 -0.1406674 0.5666932 -0.0957393 -0.0089984 -1.4554095 0.0181531 -0.238735 0.2767485 -0.2708101 0.0708854 -0.5469983 0.0088852 -0.3712552 0.4657088 -0.0413031 -0.0742128 -0.1069188 0.3963143 0.0229153 -0.2119535 0.0206041 0.3452539 0.343597 0.0596347 0.0355721 0.1887393 0.3902073 0.0636516 0.1253429 0.0568198 0.4475358 0.0141643 -0.0200927 0.0156926 -0.1533248 0.0418591 -0.0313641 0.137977 -0.0102271 0.0205494 0.0032738 0.0067367 -0.00166 0.0680009 0.0303923 -0.0540898 0.0011658 -0.0356381 0.0878629 0.0527472 -0.0296411 0.0490748 -0.0029078 0.0455481 0.060089 0.0329459 0.0353215 0.0490802 0.0997761 0.0157061 -0.0334584 -0.0033687 0.145129 0.0161066 -0.0227627 0.0271048 0.1323887 -0.0278202 0.0089097 -0.0462175 0.0120594 0.0876739 0.0058705 -0.2498898 0.0011005 0.0876444 -0.0362581 0.0169196 -0.0187223 0.0194407 0.1093445 -0.0012064 0.0107216 0.0026331 0.0410405 0.0790486 0.0473618 -0.0030944 0.0060748 -0.0328389 0.0908936 0.0389342 0.0539631 0.0032277 0.057456 -0.0705839 -0.017659 -0.0285432 -0.0197343 -0.0749862 0.0320341 -0.0521838 0.0263514 unknown
polarizability: 68.2732115|2.5707935|38.0684028|1.1968947|-1.4720834|38.4275937 unknown
InChI: InChI=1/3C.N.O.8H
charge 1 multiplicity 1
13 atoms
C  0.07759714 -0.36149279 -0.03812176
N  1.00483035 0.40788922 -0.43099498
O  2.34944613 -0.08713444 0.31297911
H  2.97788487 -0.2851269 -0.4073253
H  2.68257977 0.7005517 0.78350928
C  -1.29062207 -0.09934147 -0.59122445
H  -1.56559704 -1.00256402 -1.14975341
H  -1.25813845 0.73502581 -1.29578065
H  0.2392732 -1.17083904 0.67499778
C  -2.29265066 0.15356839 0.54512989
H  -3.28494524 0.28957839 0.11172575
H  -2.33995622 -0.68949057 1.23935258
H  -2.04160214 1.05854003 1.10312552
