program: Gaussian 09
title: opt freq
version: EM64L-G09RevD.01
method: RwB97XD
basis: 6-31+G(d,p)
operation: Freq
keyword: #P
keyword: Geom=AllCheck
keyword: Guess=TCheck
keyword: SCRF=Check
keyword: GenChk
keyword: RwB97XD/6-31+G(d,p)
keyword: Freq
converged: YES YES NO NO
title: Mulliken charges:
elementType: C N O H H C H H H O H H C C C C H C H C H H H
charge: -0.016439 -0.138301 -0.421786 0.563201 0.453549 -0.625538 0.220957 0.203382 0.211985 -0.778249 0.422389 0.431027 0.258024 -0.099433 -0.083144 -0.148429 0.168907 -0.225329 0.152333 -0.112665 0.190509 0.183222 0.189829
chargesum: 1.00000
title: Mulliken charges with hydrogens summed into heavy atoms:
elementType: C N O C O C C C C C C
charge: -0.016439 -0.138301 0.594964 0.010785 0.075167 0.258024 0.069474 0.069189 0.042080 -0.042107 0.077164
polarizability: 1.13722297e+02 -6.03875098e+00 1.31683393e+02 -9.66640809e+00 -5.31444572e+00 7.85536232e+01
1716.lowfreq: -10.9566 -7.3708 -0.0013 -0.0010 -0.0005 14.5245 24.3215 44.4037 72.9042
frequency: 22.8682 44.2901 72.8883 111.5825 151.4819 161.8813 202.0658 250.1943 269.3375 272.5098 327.0554 376.6872 411.9408 460.3135 465.0769 508.7746 547.3006 593.6690 625.4737 641.1794 716.4682 738.0989 770.1566 791.7217 875.6332 962.2267 1013.8916 1023.3666 1024.9087 1039.6188 1041.5160 1061.9512 1101.5999 1129.2442 1147.0570 1203.3376 1226.3444 1306.6213 1349.6071 1371.8145 1390.3068 1414.0933 1472.2393 1475.7447 1497.3921 1545.6816 1623.5063 1658.8432 1679.7040 1682.6772 1710.8203 2508.3252 3087.2347 3171.0871 3203.2462 3219.9947 3229.7277 3235.5788 3247.6490 3254.6655 3801.8287 3868.3348 3979.2607
redmass: 4.7193 3.9221 3.5508 3.7163 1.1476 1.0531 4.2047 2.5177 2.4258 1.6342 3.2730 3.6256 2.8271 1.6704 1.8472 3.6352 1.7091 2.9986 3.9601 4.8229 1.9400 5.0392 4.3283 2.0789 1.2428 1.3361 1.3837 5.1916 1.5644 1.5525 1.3575 2.5084 1.4862 1.5660 1.9619 1.1260 1.1283 4.2788 3.2601 1.6654 1.0626 1.2184 1.1111 1.0637 2.2184 2.2464 1.1088 5.1203 4.1339 2.2930 1.7461 1.0806 1.0353 1.1012 1.1058 1.0894 1.0891 1.0916 1.0958 1.0988 1.0665 1.0436 1.0857
irintensity: 1.5958 1.8804 3.3977 1.6707 6.8647 6.3980 1.6382 50.6008 57.4046 210.7349 2.4436 94.5370 3.6789 20.2931 73.8180 2.5874 26.1911 20.3087 8.3722 2.9676 48.7879 19.7161 14.6379 83.0201 2.8412 2.1848 3.1880 5.1319 26.3295 5.8330 0.9525 4.2251 42.4195 9.1824 37.4996 0.4733 1.2756 30.9767 3.2235 1.4257 62.8098 15.1375 25.0218 24.5988 9.1322 2.1400 61.9782 9.5772 27.6524 14.1969 105.3122 2964.6222 0.5786 0.0238 2.0341 2.1573 0.7319 1.6584 4.4879 0.9625 260.0195 103.4118 197.8696
temp: 298.150 k
press: 1.00000 atm
elementType: 6 7 8 1 1 6 1 1 1 8 1 1 6 6 6 6 1 6 1 6 1 1 1
symmnumber: 1
zpe: 504642.9 jmol-1
zpe.correction: 0.192208 hartree
zpe.thermalcorrener: 0.204730 hartree
zpe.thermalcorrenthalpy: 0.205674 hartree
zpe.thermalcorrgfe: 0.152458 hartree
zpe.sumelectzpe: -516.640105 hartree
zpe.sumelectthermal: -516.627584 hartree
zpe.sumelectthermalent: -516.626640 hartree
zpe.sumelectthermalfe: -516.679856 hartree
dipole: 2.4974 6.5951 0.0680
dipole: 7.0525
quadrupole: -40.7871 -22.1985 -56.4304
quadrupole: 13.8602 -4.6777 -4.4516
quadrupole: -0.9817 17.6068 -16.6251 13.8602 -4.6777 -4.4516
hfenergy: -516.8323132 hartree
pointgroup: C01 [X(C8H12N1O2)]
dipole: 0.987401 2.5777163 0.03433 debye
dipolederiv: 0.5399336 -0.1944907 0.1238757 -0.2068053 1.0160303 0.1268487 0.1083632 0.0937966 0.1868081 0.6691946 0.3729614 0.3746403 0.1492198 -0.6049936 -0.0151065 0.3384482 0.2053685 -0.118208 -1.2377956 -0.7443447 -0.2168899 -0.2698678 -0.5231703 0.1168722 -0.0689232 0.0452595 -0.5363825 0.7015784 0.5295993 -0.3603937 0.4566794 0.8160051 -0.3105507 -0.6395535 -0.6233256 0.627263 0.2458647 0.0041039 0.0236038 0.015964 0.3744916 0.0367335 0.0722665 0.1174804 0.4732211 -0.1417278 0.0130034 -0.0336803 -0.0955589 -0.1070947 -0.0494159 -0.0143295 -0.0691178 -0.0079731 0.0512453 -0.0213649 0.0283372 0.0196897 0.0876257 -0.041572 0.0169178 -0.0559273 0.028995 0.0743021 -0.0314476 -0.0268852 -0.0325441 0.0609111 0.0671905 -0.0014077 0.0481208 0.039847 0.065311 0.0401667 -0.0105936 0.0622127 0.0027325 -0.0037302 -0.0042752 -0.0211433 0.1075715 -0.6739082 -0.2192667 0.1064578 -0.1832651 -0.7696648 0.0741766 0.223355 0.1932568 -0.7059714 0.3001765 -0.0242968 0.0396258 -0.010941 0.3938131 0.0123831 0.0271611 0.0067329 0.3638176 0.3884543 0.0265859 0.0027415 -0.0101014 0.343947 0.0435609 0.0269707 0.0629236 0.3354853 -0.1811042 0.2537669 -0.059409 0.1488405 -0.2791403 -0.0535828 -0.0744227 -0.0064659 -0.0205848 0.0077524 0.1172895 -0.0559763 -0.1585635 0.078886 0.0263139 -0.0548788 0.0039057 -0.0627488 0.017699 -0.2115578 -0.0160492 0.0461048 -0.0117087 -0.07177 -0.0313646 -0.0474286 -0.0487529 -0.1490891 0.0789409 -0.0155469 0.1017646 0.0364499 -0.1120806 -0.0107736 -0.115115 -0.0598004 -0.0099514 0.0142778 0.0721434 0.0297508 0.0926082 -0.0042943 0.0648055 -0.0040167 0.1015729 0.0641777 0.0145126 -0.1069257 -0.0150544 -0.1926806 0.0192099 -0.1030949 0.0341239 -0.0500295 0.0718052 -0.0122696 0.0278518 -0.0255556 -0.0200728 0.0765489 0.0288447 0.0722588 0.0840125 0.0394297 -0.0661563 -0.0365198 -0.0700528 0.1006901 -0.0201373 -0.0489231 -0.0270113 -0.0520763 0.084451 -0.020337 0.0430428 -0.0129679 0.010196 0.0523417 0.0457763 0.0504009 0.0996022 0.0065579 0.021489 0.0740163 0.004124 0.078581 0.0181797 0.0756947 0.0242892 0.0906696 0.0656427 0.0588348 0.0225332 0.0569275 0.0155581 0.0118807 0.0233432 0.0116339 0.1236621 unknown
polarizability: 113.7222971|-6.038751|131.6833932|-9.6664081|-5.3144457|78.5536232 unknown
InChI: InChI=1/8C.N.2O.12H
charge 1 multiplicity 1
23 atoms
C  -1.26606031 0.65406486 0.032803
N  -0.94173069 1.84902836 0.37632739
O  0.48735573 1.85542256 0.91944544
H  1.04888515 2.41507474 0.24305187
H  0.40607885 2.35201008 1.75049733
C  -2.68622558 0.56398468 -0.44600201
H  -2.69363552 0.16429371 -1.46321525
H  -3.23258445 -0.13900239 0.18938517
H  -3.18322591 1.53388081 -0.41755881
O  1.77747963 3.12437827 -0.7902688
H  1.38560323 3.84648868 -1.29408531
H  2.73638473 3.21005942 -0.82507893
C  -0.41934349 -0.55797914 0.04065124
C  -0.87872107 -1.71272992 0.68296282
C  0.8012914 -0.57564087 -0.64489542
C  -0.10127755 -2.86618084 0.66923148
H  -1.82745701 -1.71147341 1.21011137
C  1.55839363 -1.74071062 -0.67726778
H  1.1412059 0.3039187 -1.18340213
C  1.11295758 -2.88243853 -0.0130495
H  -0.45094799 -3.75515612 1.18233327
H  2.49478258 -1.76006064 -1.22423942
H  1.70864464 -3.78871092 -0.03496438
