program: Gaussian 09
title: 000052680
version: EM64L-G09RevD.01
frameworkgroup: C1[X(C20H24N2)]
method: RPBEPBE
basis: SDD
operation: Freq
keyword: #pfreq=noraman
keyword: PBEPBE/SDD
title: #p freq=noraman PBEPBE/SDD
converged: YES YES NO NO
title: Mulliken charges:
elementType: N N C C C C C C C C C C C C C C C C C C C C H H H H H H H H H H H H H H H H H H H H H H H H
charge: -0.119015 -0.109584 -0.083794 -0.432556 -0.429553 -0.476207 0.387513 0.422477 0.271615 0.362813 -0.548443 -0.614430 -0.624750 -0.624205 -0.441752 -0.473435 -0.359674 -0.442382 -0.261653 -0.249204 -0.257959 -0.240201 0.225555 0.199086 0.235569 0.237004 0.195292 0.195862 0.221746 0.232949 0.197648 0.270511 0.239343 0.189422 0.220829 0.220840 0.189561 0.238533 0.232136 0.235931 0.230519 0.234412 0.227041 0.225146 0.225993 0.223447
chargesum: 0.00000
title: Mulliken charges with hydrogens summed into heavy atoms:
elementType: N N C C C C C C C C C C C C C C C C C C C C
charge: -0.119015 -0.109584 0.141762 0.002099 0.002743 -0.280345 0.387513 0.422477 0.271615 0.362813 -0.093748 -0.146270 0.024845 0.024730 -0.209615 -0.237504 -0.129154 -0.207970 -0.034612 -0.024058 -0.031966 -0.016754
polarizability: 2.18149303e+02 4.77759448e+00 2.56003066e+02 -2.23058446e+01 -1.30659687e+00 1.90490246e+02
1716.lowfreq: -7.6803 -0.0005 0.0002 0.0004 3.8817 5.8013 29.0704 36.0448 44.4083
frequency: 28.8518 35.8818 44.3146 55.3121 82.4954 103.7551 108.5944 154.8942 172.9303 187.2632 210.1937 237.1578 249.2118 262.8899 278.4316 281.9137 313.1070 334.2187 338.0935 357.3404 367.9581 431.3993 454.2918 462.1941 469.1654 479.7704 517.4302 534.2492 547.3231 589.4480 628.2226 630.1433 661.6095 708.8508 722.8321 740.6720 746.6677 762.3656 771.7337 806.1716 849.3819 856.0457 872.8320 877.7934 886.6220 888.9916 919.4870 941.4149 946.3675 953.4764 976.1629 985.0053 985.3891 1005.3855 1033.1167 1036.0807 1041.7356 1053.3286 1059.7793 1067.7422 1088.0331 1091.3562 1102.2914 1104.9983 1113.2244 1127.4207 1147.2790 1169.1851 1171.2839 1173.6787 1181.4183 1184.2094 1194.3976 1204.7631 1211.6145 1225.5965 1229.1963 1248.1181 1254.2353 1259.8267 1266.7162 1282.8645 1293.4430 1328.3183 1336.1933 1346.7966 1350.3534 1361.1658 1381.9524 1394.8641 1416.9287 1431.4564 1441.7876 1443.0710 1445.4365 1455.3014 1458.2313 1460.9066 1471.4410 1474.0992 1477.4628 1485.2101 1485.8855 1487.9353 1585.5166 1593.0487 1607.8684 1612.9106 2838.7123 2849.3938 2857.2948 2876.8551 2930.8007 2943.2150 2955.0906 2985.7630 3009.0633 3021.3745 3022.8304 3051.3703 3058.1776 3064.0758 3078.1248 3081.8952 3107.0320 3111.0518 3112.8579 3115.8906 3134.7429 3135.2101 3157.5711 3157.9022
redmass: 4.0029 3.9221 4.0538 2.8926 3.8725 3.8399 3.3551 2.9652 3.2673 2.4291 1.8069 1.1930 1.6747 2.9653 2.2976 3.2845 4.7578 3.3539 3.4532 3.0312 2.7415 2.7058 2.9623 3.0172 2.7577 3.2884 3.2927 4.2915 3.9175 2.9303 5.8939 3.4530 4.2712 4.2281 2.7754 2.2978 3.5963 1.3402 1.9219 3.1633 3.2356 2.0152 3.1662 1.6816 1.7594 1.3509 2.5655 2.3213 1.5310 1.6112 2.2917 1.3355 1.3282 2.9207 2.7878 1.6507 2.3433 2.6651 4.1358 2.1513 1.8635 1.3063 1.3233 1.7325 1.8174 1.7189 2.1074 1.3736 1.1396 1.2602 1.8278 1.4172 1.6170 2.4780 2.2133 1.5239 1.4762 1.5566 1.4991 1.4089 1.4427 2.2155 1.4427 1.4201 1.7671 1.5576 1.5569 1.4012 5.0370 3.0011 1.1405 2.2285 2.2201 1.1813 1.1229 1.1161 1.0696 1.0566 1.0497 1.0568 1.1207 1.0612 2.4149 2.5209 6.5220 6.6496 6.1628 6.4624 1.0816 1.0570 1.0640 1.0757 1.0641 1.0658 1.0614 1.0637 1.0941 1.0720 1.0722 1.1023 1.0974 1.1003 1.1011 1.1008 1.0867 1.0863 1.0884 1.0890 1.0922 1.0927 1.1005 1.1006
irintensity: 0.2312 0.0853 0.2034 0.1430 0.6804 0.1901 0.3347 2.0121 0.3224 0.8683 0.2079 0.1157 0.5997 5.4102 3.6409 1.8413 1.0962 2.7402 4.3972 0.9778 0.3273 5.2850 1.5969 0.8066 2.7824 4.2548 5.4919 1.4313 0.2456 6.7051 8.9490 7.5766 3.4728 10.0648 3.2006 30.4833 15.8308 39.0490 55.0416 13.7652 3.0998 2.3429 21.6156 0.8720 4.3618 5.4438 1.5903 23.3675 1.7160 0.0414 2.5577 0.0923 0.0054 5.0650 6.9788 2.7478 6.4007 13.2659 16.7958 9.1095 1.9483 7.7775 4.5962 6.5199 0.6323 9.4518 38.0843 2.8310 1.5306 7.8229 11.5331 0.7979 4.6641 10.3831 2.0751 0.5132 2.3363 0.9589 4.5607 2.9133 11.1837 1.9113 4.7754 1.5849 1.9197 36.1031 22.6922 1.1696 1.8530 1.5375 3.9471 5.0044 1.5633 9.8556 9.0222 26.6855 8.0106 9.0407 4.0034 17.2667 14.3628 11.4199 15.3045 24.7766 1.6623 0.4428 1.6212 0.7082 54.1177 64.0650 102.8960 168.3743 61.6229 61.1958 26.3157 36.5956 42.6048 26.2530 52.8619 5.7928 34.7254 30.9968 15.8932 62.7276 15.3154 11.9178 4.5575 2.9715 20.5132 36.7792 59.0314 17.1760
temp: 298.150 k
press: 1.00000 atm
elementType: 7 7 6 6 6 6 6 6 6 6 6 6 6 6 6 6 6 6 6 6 6 6 1 1 1 1 1 1 1 1 1 1 1 1 1 1 1 1 1 1 1 1 1 1 1 1
symmnumber: 1
zpe: 1025325.7 jmol-1
zpe.correction: 0.390526 hartree
zpe.thermalcorrener: 0.410143 hartree
zpe.thermalcorrenthalpy: 0.411087 hartree
zpe.thermalcorrgfe: 0.342041 hartree
zpe.sumelectzpe: -884.367388 hartree
zpe.sumelectthermal: -884.347771 hartree
zpe.sumelectthermalent: -884.346827 hartree
zpe.sumelectthermalfe: -884.415873 hartree
dipole: 1.2928 0.1041 0.5498
dipole: 1.4087
quadrupole: -122.9490 -124.6595 -127.2073
quadrupole: 0.4315 -3.6913 -0.1228
quadrupole: 1.9896 0.2791 -2.2687 0.4315 -3.6913 -0.1228
hfenergy: -884.7579143 hartree
pointgroup: C01 [X(C20H24N2)]
dipole: 0.4751293 -0.1634536 -0.2339061 debye
polarizability: 219.52178|4.4670402|256.1419918|20.4193181|-6.0019824|188.9788434 unknown
InChI: InChI=1S/C20H24N2/c1-21(2)17-13-22(14-17)20-18-9-5-3-7-15(18)11-12-16-8-4-6-10-19(16)20/h3-10,17,20H,11-14H2,1-2H3
charge 0 multiplicity 1
46 atoms
N  0.979053 -0.181283 -0.444415
N  4.250823 -1.023338 -0.002886
C  3.040566 -0.685789 -0.766937
C  2.269911 0.597553 -0.315052
C  1.745759 -1.485114 -0.405078
C  -0.069639 0.048684 0.595732
C  -1.187974 -0.998755 0.466778
C  -0.539721 1.504137 0.556354
C  -2.224123 -0.981394 -0.516728
C  -1.136528 2.054627 -0.6146
C  -2.47558 0.108787 -1.566761
C  -1.382093 1.173563 -1.825511
C  5.317074 -0.016005 -0.185341
C  4.723345 -2.393359 -0.293755
C  -1.153683 -2.067825 1.403971
C  -0.357292 2.322034 1.695586
C  -3.165739 -2.048426 -0.516572
C  -1.52348 3.416244 -0.609112
C  -2.097003 -3.114365 1.391753
C  -0.756296 3.678236 1.695281
C  -3.115823 -3.105167 0.413373
C  -1.338569 4.229779 0.533026
H  3.220028 -0.682772 -1.870496
H  2.522929 0.848643 0.739566
H  2.323267 1.501484 -0.943965
H  1.37724 -2.253597 -1.103891
H  1.83551 -1.909182 0.619848
H  0.389348 -0.110974 1.605342
H  -2.69414 -0.398573 -2.527763
H  -3.411512 0.63444 -1.281986
H  -1.706518 1.797884 -2.67962
H  -0.442906 0.659574 -2.09932
H  4.942268 0.981464 0.104345
H  5.690666 0.047549 -1.239342
H  6.174011 -0.261997 0.467212
H  5.582971 -2.63408 0.357131
H  5.043839 -2.535166 -1.357659
H  3.918879 -3.119112 -0.080513
H  -0.364084 -2.069268 2.165792
H  0.101361 1.891036 2.594454
H  -3.963078 -2.037293 -1.271362
H  -1.978592 3.842213 -1.512065
H  -2.03867 -3.92036 2.131423
H  -0.610001 4.295428 2.588722
H  -3.862221 -3.906738 0.377703
H  -1.646684 5.281473 0.514939
