program: Gaussian 09
title: opt freq
version: EM64L-G09RevD.01
method: RwB97XD
basis: 6-31+G(d,p)
operation: Freq
keyword: #P
keyword: Geom=AllCheck
keyword: Guess=TCheck
keyword: SCRF=Check
keyword: GenChk
keyword: RwB97XD/6-31+G(d,p)
keyword: Freq
converged: YES YES YES YES
title: Mulliken charges:
elementType: C N O H H C H H H C H H C F F F
charge: 0.130038 -0.078946 -0.319271 0.479166 0.471186 -0.524893 0.231001 0.235053 0.231692 -0.420885 0.256406 0.256610 0.890824 -0.237136 -0.237879 -0.362968
chargesum: 1.00000
title: Mulliken charges with hydrogens summed into heavy atoms:
elementType: C N O C C C F F F
charge: 0.130038 -0.078946 0.631082 0.172853 0.092131 0.890824 -0.237136 -0.237879 -0.362968
polarizability: 6.25027731e+01 -3.61919547e+00 6.59013792e+01 5.11811248e+00 -3.76069543e+00 4.78125190e+01
1716.lowfreq: -11.9034 -6.6694 -0.0009 0.0009 0.0012 10.1666 56.1630 114.0361 194.8266
frequency: 56.1012 114.0213 194.8110 210.6819 245.5671 291.5024 305.9758 365.4810 395.0254 407.1855 490.7262 510.4932 527.7155 540.5061 685.6817 708.4837 822.4430 863.8355 921.6378 944.0578 1020.1627 1047.6514 1100.1881 1129.2707 1215.0531 1250.5112 1300.9058 1334.7698 1410.4920 1415.1563 1472.8734 1477.4593 1494.7564 1619.1327 1735.3410 3076.8865 3118.4568 3162.3362 3183.1779 3203.7061 3477.9570 3777.6112
redmass: 8.5769 4.0294 1.7967 2.0177 5.7183 2.5699 4.5509 1.4678 3.1607 2.5378 4.2677 5.4407 7.9684 10.2539 6.1122 5.5753 5.3980 2.6569 1.4081 1.7052 1.6014 1.6527 1.9914 1.3366 2.5830 2.6578 7.0879 2.1652 1.4454 1.6722 1.1103 1.0546 1.0884 1.0991 6.6447 1.0356 1.0615 1.1024 1.1070 1.1053 1.0589 1.0734
irintensity: 1.3457 5.0334 11.1476 29.2244 2.9390 47.7176 2.7018 68.8290 10.2237 3.4077 63.7117 10.6197 4.5778 1.8553 36.3129 54.4335 40.0881 33.4780 91.2417 84.8326 24.3858 3.3601 127.0929 19.7452 96.5084 141.3144 143.4702 116.3041 62.2537 112.1617 21.5381 9.1911 17.5426 102.9558 16.6383 5.1280 4.3051 1.8464 4.3257 2.2087 425.2035 437.6040
temp: 298.150 k
press: 1.00000 atm
elementType: 6 7 8 1 1 6 1 1 1 6 1 1 6 9 9 9
symmnumber: 1
zpe: 314772.1 jmol-1
zpe.correction: 0.119890 hartree
zpe.thermalcorrener: 0.129166 hartree
zpe.thermalcorrenthalpy: 0.130110 hartree
zpe.thermalcorrgfe: 0.085609 hartree
zpe.sumelectzpe: -585.544039 hartree
zpe.sumelectthermal: -585.534763 hartree
zpe.sumelectthermalent: -585.533819 hartree
zpe.sumelectthermalfe: -585.578320 hartree
dipole: 6.3389 -0.8810 -0.9406
dipole: 6.4685
quadrupole: -33.3392 -35.5585 -45.4249
quadrupole: -8.3795 4.4777 -4.6163
quadrupole: 4.7683 2.5490 -7.3173 -8.3795 4.4777 -4.6163
hfenergy: -585.663929 hartree
pointgroup: C01 [X(C4H7F3N1O1)]
dipole: 2.1663415 0.0315991 -0.5517548 debye
dipolederiv: 0.4031159 -0.007147 0.0952994 0.0335229 0.4568728 -0.0241973 0.1554509 -0.0067061 0.1475283 -0.2299891 -0.0265923 0.0060132 -0.3889995 0.9930295 -0.1753467 -0.0407347 -0.0345504 -0.1743017 -0.4604008 -0.0246126 -0.0018631 0.4133014 -1.3041915 0.2348101 0.0334574 0.0919272 -0.1940032 0.5695155 -0.1889546 0.0527425 -0.1083689 0.3605498 -0.0086895 0.0322301 -0.010454 0.3804996 0.6305772 0.2049028 -0.0892473 0.0729842 0.3127628 -0.0527833 -0.0851692 -0.0996044 0.3594741 -0.1006736 0.1154653 -0.0326283 0.015031 -0.1117256 0.0082597 -0.0394057 0.0708042 -0.0204348 0.1276838 0.0052822 -0.0210092 0.0247293 0.0606925 -0.0233777 -0.0085586 -0.0269772 0.0271064 0.0583354 -0.0245086 0.0425711 -0.0014494 0.0741105 0.0354199 0.0321832 0.0177524 0.1060066 0.0531632 -0.0254467 -0.0400757 0.0024984 0.0978905 0.0034791 -0.0397059 -0.0132401 0.1050938 -0.124907 -0.0607585 0.0395243 -0.1259947 -0.1619082 0.0318751 0.0980115 0.0479919 -0.0565717 0.0766718 -0.0006778 0.0052179 0.0073052 0.0805803 0.0376871 -0.0093013 0.0125649 0.1122656 0.039557 0.0028779 0.021152 -0.0083584 0.0558156 -0.0142266 -0.0056134 0.0020545 0.1248623 1.8228182 0.1107426 0.0528752 0.0675687 1.6243668 0.064 -0.0508583 0.0250904 1.4641515 -0.7156975 -0.3242677 -0.1880844 -0.353784 -0.4913744 -0.1597309 -0.1074674 -0.0940498 -0.3437107 -0.4505919 0.1471018 0.180073 0.1383898 -0.5443302 -0.1933789 0.2243695 -0.2411385 -0.4896936 -0.6991781 0.0965933 -0.1225605 0.2116239 -0.5031412 0.2361999 -0.1888884 0.2585352 -0.5482724 unknown
polarizability: 62.5027731|-3.6191955|65.9013792|5.1181125|-3.7606954|47.812519 unknown
InChI: InChI=1/4C.3F.N.O.7H
charge 1 multiplicity 1
16 atoms
C  1.04707642 0.7405108 -0.317849
N  2.13285966 0.35027601 0.22874122
O  2.20556937 -1.19746491 0.19989315
H  3.0866461 -1.39483706 0.56638937
H  1.49260624 -1.5720709 0.77471847
C  0.90194162 2.23111465 -0.3420651
H  0.81642012 2.55738073 -1.38331984
H  -0.02222082 2.50110268 0.17836594
H  1.7496773 2.72857854 0.12876792
C  -0.04386635 -0.12902437 -0.89752113
H  -0.67126752 0.47209924 -1.5584898
H  0.37513986 -0.95510206 -1.47842657
C  -0.95094035 -0.70680034 0.18383741
F  -1.90140907 -1.46026952 -0.33456326
F  -1.49128466 0.23911178 0.94429397
F  -0.21546305 -1.51592794 1.03823175
