program: Gaussian 09
title: opt freq
version: EM64L-G09RevD.01
method: RwB97XD
basis: 6-31+G(d,p)
operation: Freq
keyword: #P
keyword: Geom=AllCheck
keyword: Guess=TCheck
keyword: SCRF=Check
keyword: GenChk
keyword: RwB97XD/6-31+G(d,p)
keyword: Freq
converged: YES YES YES YES
title: Mulliken charges:
elementType: C N O H H C H H H C H H C C H H H
charge: 0.174439 -0.181890 -0.190570 0.462888 0.355339 -0.575825 0.225105 0.219188 0.226094 -0.346483 0.232303 0.237573 -0.166075 -0.311219 0.216777 0.219934 0.202425
chargesum: 1.00000
title: Mulliken charges with hydrogens summed into heavy atoms:
elementType: C N O C C C C
charge: 0.174439 -0.181890 0.627657 0.094561 0.123393 0.050702 0.111140
polarizability: 6.77717194e+01 8.18433373e+00 8.09762805e+01 1.50541495e+00 -7.77092937e+00 5.35461658e+01
1716.lowfreq: -31.8216 -13.9432 -11.5940 0.0006 0.0007 0.0009 85.8314 151.2629 174.2074
frequency: 85.2668 151.2252 174.0889 259.4728 284.5945 324.4695 328.6807 433.7506 483.1697 505.7766 567.4737 653.2147 721.9147 850.3418 922.9439 933.5890 963.9799 1025.7266 1033.4036 1047.9695 1056.1286 1134.7811 1184.5038 1224.8970 1274.6937 1337.0105 1365.0974 1415.1334 1463.9318 1470.1460 1477.9353 1487.4412 1606.9276 1712.4011 1727.3013 2989.5851 3074.5693 3085.3473 3152.3341 3157.8020 3176.8820 3199.4560 3199.8696 3283.5338 3792.1975
redmass: 2.4552 2.9825 1.1111 2.2883 2.7803 3.5425 2.9127 1.8733 1.1815 4.8718 2.6292 1.6797 5.4057 2.2706 1.8560 1.4789 1.3595 1.3711 1.3942 1.4322 1.1261 1.7808 1.3584 1.6091 1.5179 1.2443 1.8629 1.2246 1.1800 1.1179 1.0521 1.0868 1.0862 4.2815 6.7760 1.0684 1.0362 1.0635 1.1023 1.1020 1.0622 1.0941 1.1041 1.1165 1.0692
irintensity: 3.3550 1.7490 3.7691 20.7920 16.6857 6.8072 11.9267 9.3673 86.1656 65.6277 19.2311 17.3052 75.9477 6.1151 14.3027 38.3385 62.1086 52.0681 1.2631 16.7214 49.8180 2.0474 44.2562 1.0690 1.3379 2.5385 5.2828 16.3940 4.4674 23.0352 30.4237 6.8945 82.0516 4.6818 16.1668 1011.9735 2.8646 3.2848 1.2320 0.2304 2.8385 0.3475 0.9720 0.1754 386.2964
temp: 298.150 k
press: 1.00000 atm
elementType: 6 7 8 1 1 6 1 1 1 6 1 1 6 6 1 1 1
symmnumber: 1
zpe: 387595.8 jmol-1
zpe.correction: 0.147627 hartree
zpe.thermalcorrener: 0.155758 hartree
zpe.thermalcorrenthalpy: 0.156702 hartree
zpe.thermalcorrgfe: 0.115621 hartree
zpe.sumelectzpe: -325.933489 hartree
zpe.sumelectthermal: -325.925359 hartree
zpe.sumelectthermalent: -325.924415 hartree
zpe.sumelectthermalfe: -325.965496 hartree
dipole: -0.4123 -1.7165 1.0428
dipole: 2.0503
quadrupole: -33.7752 -23.6072 -35.8537
quadrupole: 1.0833 0.7598 -6.7677
quadrupole: -2.6965 7.4715 -4.7750 1.0833 0.7598 -6.7677
hfenergy: -326.0811169 hartree
pointgroup: C01 [X(C5H10N1O1)]
dipole: -0.0938929 -0.6560524 0.3800111 debye
dipolederiv: 0.4038511 0.0668421 0.1271891 0.0785284 0.4736213 -0.0709362 0.1528025 -0.0301195 0.1589855 -0.214127 0.4138821 -0.1118589 0.1424106 0.8745716 -0.2060766 -0.0940705 -0.0804349 -0.1990115 -0.8351123 -0.4129129 0.0226081 0.0537947 -1.1654184 0.2787663 0.0630689 0.1115885 -0.1669667 0.4026968 -0.1866951 0.071552 -0.1346545 0.4217357 -0.0563857 0.0695652 -0.0667021 0.404642 1.0801026 0.1033642 0.0211167 -0.1433324 0.0476887 0.0031385 -0.0461338 -0.0075444 0.2291291 -0.0305532 0.0525685 -0.0301923 -0.0151285 -0.133984 0.0377375 -0.0162076 0.081378 -0.0111034 0.1253506 -0.0197678 -0.0257983 -0.005016 0.0529698 -0.0167425 -0.0189251 -0.0190991 0.0193944 0.0260269 0.008233 0.0630174 0.0105547 0.0643099 0.0132816 0.0501619 -0.0074378 0.0904809 0.0351854 -0.0196979 -0.0352187 0.0123796 0.085053 0.0189801 -0.047239 -0.0056859 0.1000318 0.0381299 -0.0541223 -0.0175875 -0.2006145 -0.1082875 0.0001794 0.0499135 0.035012 0.0331065 0.0558373 -0.0217944 0.0089422 0.0238832 0.0266315 0.0486555 0.0361827 0.0505639 0.0872625 0.0216659 -0.0021711 0.0186972 0.0031111 0.036216 -0.0650408 0.0253673 -0.0039353 0.0725874 -0.3097529 -0.0264211 -0.1718163 0.064048 0.1761492 -0.0267495 -0.3478349 -0.1238495 0.0507221 -0.1752322 0.1555928 -0.0943205 0.1824094 -0.0712868 0.1151654 -0.0415214 0.1395214 0.0093814 0.1315807 -0.0210116 0.0376426 -0.0317337 0.0215816 -0.0340146 0.0638978 -0.0131061 0.0304251 0.1208689 -0.0380852 0.0523988 -0.0371853 0.0955367 -0.0152553 0.0463947 -0.0018903 0.0667113 0.1234815 0.0021968 0.0636284 -0.003455 0.1029116 -0.0247031 0.0545779 -0.0582587 0.0242214 unknown
polarizability: 67.7717194|8.1843337|80.9762805|1.5054149|-7.7709294|53.5461658 unknown
InChI: InChI=1/5C.N.O.10H
charge 1 multiplicity 1
17 atoms
C  0.58454279 0.78858672 -0.25350943
N  1.45636886 0.08559204 0.36423866
O  0.98795495 -1.37048517 0.43229945
H  1.579078 -1.78252302 1.0856815
H  0.01476514 -1.43491361 0.70215661
C  0.985812 2.22127372 -0.41991272
H  0.98888734 2.45912598 -1.48843713
H  0.24301666 2.861187 0.0659159
H  1.97201439 2.41808624 0.00044638
C  -0.75029467 0.2991201 -0.76395873
H  -1.2912292 1.14723808 -1.19186367
H  -0.57850569 -0.42025342 -1.5737772
C  -1.57045835 -0.3235124 0.34910514
C  -2.03432283 -1.57913156 0.32972718
H  -1.7971233 0.32024952 1.19747985
H  -2.64082919 -1.96091494 1.14459136
H  -1.86808977 -2.24158146 -0.51825086
