program: Gaussian 09
title: opt freq
version: EM64L-G09RevD.01
method: RwB97XD
basis: 6-31+G(d,p)
operation: Freq
keyword: #P
keyword: Geom=AllCheck
keyword: Guess=TCheck
keyword: SCRF=Check
keyword: GenChk
keyword: RwB97XD/6-31+G(d,p)
keyword: Freq
converged: YES YES YES YES
title: Mulliken charges:
elementType: C N O H H C H H H C H H C H H H
charge: -0.013499 -0.086441 -0.386755 0.459916 0.457458 -0.483930 0.229805 0.231277 0.228589 -0.131380 0.230330 0.200543 -0.523759 0.184757 0.212877 0.190213
chargesum: 1.00000
title: Mulliken charges with hydrogens summed into heavy atoms:
elementType: C N O C C C
charge: -0.013499 -0.086441 0.530619 0.205741 0.299493 0.064088
polarizability: 7.30582510e+01 -3.19559820e+00 5.80291005e+01 1.42653848e+00 9.81992106e-01 4.50174908e+01
1716.lowfreq: -24.8321 -13.1382 0.0010 0.0013 0.0015 16.8562 49.7089 165.1628 166.5768
frequency: 47.0128 165.0355 166.5625 215.3872 258.5484 269.5368 330.0747 368.4590 414.2171 568.5161 631.4845 770.9927 797.2615 891.1591 933.0167 1006.9817 1021.1003 1036.6736 1096.0896 1122.1147 1232.1002 1301.1994 1385.8556 1404.5119 1445.7391 1468.3184 1478.9447 1497.2303 1511.0560 1522.6412 1647.0541 1700.8555 3078.0780 3086.7439 3089.2840 3172.9195 3180.0930 3182.4578 3191.6451 3202.7925 3725.9724 3826.9128
redmass: 2.1337 1.1388 1.0812 1.4018 2.9804 3.2590 1.7478 4.1705 2.8164 2.8229 4.9127 2.9847 1.2178 1.3000 1.1574 1.7691 1.3464 1.5285 1.9944 1.7955 2.6465 1.4591 1.2468 1.1986 1.1976 1.0899 1.0644 1.0713 1.0490 1.0428 1.0994 6.1664 1.0681 1.0349 1.0368 1.1015 1.1033 1.1025 1.0984 1.1052 1.0440 1.0856
irintensity: 1.3982 6.1427 62.5467 0.8710 14.5327 8.3936 8.2094 68.8542 55.5549 8.7026 52.2095 27.5628 5.8363 208.9378 1.6808 0.7924 2.9614 2.0821 9.7318 0.7252 0.5482 0.5139 0.5414 7.6533 4.3452 17.9195 16.6278 27.0295 15.0344 8.1539 127.2092 20.3364 2.3397 2.5433 7.8904 4.2702 2.2271 1.1384 5.7917 0.9400 354.1944 262.0175
temp: 298.150 k
press: 1.00000 atm
elementType: 6 7 8 1 1 6 1 1 1 6 1 1 6 1 1 1
symmnumber: 1
zpe: 373489.9 jmol-1
zpe.correction: 0.142255 hartree
zpe.thermalcorrener: 0.150472 hartree
zpe.thermalcorrenthalpy: 0.151416 hartree
zpe.thermalcorrgfe: 0.110042 hartree
zpe.sumelectzpe: -287.867851 hartree
zpe.sumelectthermal: -287.859634 hartree
zpe.sumelectthermalent: -287.858690 hartree
zpe.sumelectthermalfe: -287.900064 hartree
dipole: 3.9582 -0.7545 -0.2482
dipole: 4.0371
quadrupole: -11.0036 -30.8593 -32.1277
quadrupole: -4.6395 0.8606 -0.6321
quadrupole: 13.6599 -6.1958 -7.4641 -4.6395 0.8606 -0.6321
hfenergy: -288.0101057 hartree
pointgroup: C01 [X(C4H10N1O1)]
dipole: 1.5233432 -0.2844788 -0.0970052 debye
dipolederiv: 0.2546768 0.0820235 0.0740301 0.1344065 0.3597911 0.0879408 0.1155747 0.1019907 0.1454961 0.6729248 -0.6594749 -0.0093888 -0.935341 0.3970562 0.0008515 -0.0862145 0.0077988 -0.1921769 -1.0635367 0.4560838 -0.015602 0.8759036 -0.7599711 0.0153768 0.067331 -0.0376852 -0.2626203 0.4552511 -0.0025179 -0.068256 0.0523888 0.2946909 0.029876 -0.1950418 0.0778865 0.4057962 0.3947522 -0.0042848 0.0659862 -0.011322 0.3442152 -0.0573105 0.2029691 -0.1114215 0.4201297 -0.1253822 0.0853253 0.0106149 -0.1036317 -0.0031835 -0.0210869 -0.0142874 0.0020315 -0.0153559 0.0557096 0.0342806 -0.0293765 0.035876 0.0884275 -0.0488933 -0.0119913 -0.0439082 0.0363825 0.0485508 0.0200343 0.027537 0.0353188 0.0720096 0.0570384 0.008977 0.058082 0.0693619 0.0684688 -0.0608802 -0.0128799 -0.0327987 0.0728344 -0.0101233 -0.0149993 -0.0068365 0.1228472 -0.0101873 -0.0341224 -0.014214 0.0223523 0.0147733 -0.0426315 -0.0389654 -0.0701362 0.0408389 0.0816042 -0.00475 -0.0088226 -0.058442 0.040623 0.0531949 0.0133543 0.0431691 0.0100861 -0.0362407 0.0418244 0.0084669 -0.0007987 0.0044251 -0.0097 -0.0044432 0.0171731 0.0841583 0.1264992 0.0465176 0.0008115 -0.0674043 -0.007894 -0.0329564 -0.0653762 -0.0602622 0.0804684 0.0062317 0.0517445 0.0143235 0.1082731 0.0010686 0.0292015 0.0040056 0.0472942 0.0529392 0.0480102 -0.0406893 0.0105539 -0.0567676 -0.0152416 -0.034891 0.0169627 -0.0447955 0.0774847 0.0226674 -0.0111145 -0.0537843 0.0019869 0.0963752 -0.0158869 0.0021448 0.0196193 -0.0758361 unknown
polarizability: 73.058251|-3.1955982|58.0291005|1.4265385|0.9819921|45.0174908 unknown
InChI: InChI=1/4C.N.O.10H
charge 1 multiplicity 1
16 atoms
C  0.00595855 0.45185658 -0.09008658
N  1.20800816 0.77836937 0.16702341
O  2.16055429 -0.56062119 0.04136102
H  2.81398035 -0.31782727 -0.63931988
H  2.62940799 -0.58196644 0.89507728
C  -0.87559952 1.67329762 0.02850797
H  -1.44778532 1.77333116 -0.89782993
H  -1.5704501 1.51702752 0.85769642
H  -0.3020897 2.58323601 0.20654821
C  -0.5859128 -0.8686998 -0.49045764
H  -0.83927995 -0.76158804 -1.55331495
H  0.1635864 -1.6555098 -0.41114443
C  -1.84652358 -1.22841454 0.30667175
H  -2.65359528 -0.51124901 0.14423557
H  -2.20210297 -2.2057471 -0.02416886
H  -1.63999043 -1.29175492 1.37795372
