program: Gaussian 09
title: opt freq
version: EM64L-G09RevD.01
method: RwB97XD
basis: 6-31+G(d,p)
operation: Freq
keyword: #P
keyword: Geom=AllCheck
keyword: Guess=TCheck
keyword: SCRF=Check
keyword: GenChk
keyword: RwB97XD/6-31+G(d,p)
keyword: Freq
converged: YES YES YES YES
title: Mulliken charges:
elementType: C N O H H O H H C C C C H C H H H N H
charge: -0.558304 -0.045943 -0.428649 0.561117 0.472078 -0.741616 0.452638 0.428863 0.169224 0.069559 0.252191 -0.259202 0.198922 -0.304620 0.198219 0.193781 0.195677 -0.097392 0.243457
chargesum: 1.00000
title: Mulliken charges with hydrogens summed into heavy atoms:
elementType: C N O O C C C C C N
charge: -0.314847 -0.045943 0.604545 0.139885 0.169224 0.268481 0.450411 -0.065421 -0.108944 -0.097392
polarizability: 6.41818848e+01 -8.26738688e+00 1.13612550e+02 3.62295390e+00 3.66087004e+00 9.17666379e+01
1716.lowfreq: -18.4154 -0.0007 0.0002 0.0006 8.2103 20.5371 39.5319 52.8161 114.3638
frequency: 38.7707 52.3684 114.3363 149.7821 165.8322 208.5598 289.3822 294.6213 379.9681 388.5141 451.2466 463.4155 475.0097 591.2686 656.4625 684.0601 742.0283 755.8058 761.8667 834.0552 894.1606 904.8413 969.0519 1010.0063 1023.9012 1031.5177 1111.3295 1135.8303 1197.7429 1240.3963 1266.8693 1282.7141 1299.1244 1317.6239 1378.5406 1463.9615 1546.1301 1578.9270 1642.9122 1666.8181 1729.9205 1760.3853 1926.6835 3190.1196 3222.5787 3227.4108 3240.9384 3263.4797 3813.3416 3845.7865 3958.8786
redmass: 4.4386 4.3448 5.1932 4.4849 1.0534 5.9984 1.2232 4.4518 2.8659 3.8284 2.3461 1.5142 4.9063 3.3249 1.6302 5.2649 3.0635 5.1086 4.6451 1.3883 3.0352 1.2582 1.4349 1.3767 6.1766 1.4737 2.0107 1.5702 1.2581 2.1741 1.2574 2.1809 1.3558 1.7650 1.2884 2.0003 2.1827 1.1268 7.6834 5.3273 1.2438 3.7136 1.0991 1.0893 1.0915 1.0904 1.0976 1.0948 1.0674 1.0437 1.0862
irintensity: 1.7748 4.8293 0.7595 2.7482 34.8905 3.3241 219.0451 26.0321 21.0238 69.7248 25.2634 57.5586 13.7125 70.9288 96.7020 1.8076 18.8895 37.3543 29.4641 24.6306 16.6389 4.1990 20.2899 2.3793 1.2181 0.3290 2.0162 3.7637 51.2897 77.6281 13.8583 34.3389 46.4091 11.0906 2.2413 29.1836 0.2084 91.1012 20.1589 8.5910 35.3308 129.9387 2381.1926 10.4920 3.9564 1.0505 1.2207 0.1992 343.2295 57.8748 243.9127
temp: 298.150 k
press: 1.00000 atm
elementType: 6 7 8 1 1 8 1 1 6 6 6 6 1 6 1 1 1 7 1
symmnumber: 1
zpe: 398591.4 jmol-1
zpe.correction: 0.151815 hartree
zpe.thermalcorrener: 0.162290 hartree
zpe.thermalcorrenthalpy: 0.163234 hartree
zpe.thermalcorrgfe: 0.115121 hartree
zpe.sumelectzpe: -493.382420 hartree
zpe.sumelectthermal: -493.371946 hartree
zpe.sumelectthermalent: -493.371002 hartree
zpe.sumelectthermalfe: -493.419114 hartree
dipole: 3.7413 6.1067 0.8738
dipole: 7.2148
quadrupole: -39.5839 -41.9227 -44.0076
quadrupole: 7.4871 5.0861 8.9877
quadrupole: 2.2542 -0.0847 -2.1695 7.4871 5.0861 8.9877
hfenergy: -493.5342355 hartree
pointgroup: C01 [X(C6H9N2O2)]
dipole: 1.4811477 2.4401345 0.3806284 debye
dipolederiv: 0.1724674 -0.1461659 0.0274694 -0.1005142 0.8669544 -0.1110587 0.014572 -0.116489 0.136888 0.170265 0.2475111 0.4969954 0.0343687 -0.5259688 -0.0040139 0.5605732 0.2874189 0.4981375 -1.0565229 -0.171062 -0.4617172 0.3320439 -0.3019517 0.0602546 -0.3506884 -0.4844533 -0.7449038 1.425974 -0.1315884 0.0821526 -0.5700615 0.3712066 -0.0586128 -0.2136377 0.0231765 0.170895 0.306019 0.014205 -0.0454795 0.0282365 0.5161613 0.1166465 -0.028454 0.142324 0.3995441 -0.9915027 -0.0471667 -0.0480721 0.1580344 -0.5346903 -0.0048528 0.1021154 -0.0317385 -0.4942669 0.3761074 0.0705235 -0.0054986 0.0924958 0.3483097 0.0070971 -0.0193756 -0.0023164 0.3894291 0.3374295 0.0555306 0.0421763 0.0548409 0.3388228 0.0183229 0.0250282 0.0084769 0.3152006 -0.0223294 0.1141034 -0.0712734 0.0207955 -0.1913111 0.0874148 -0.0858325 0.1810623 0.2226299 -0.0571864 -0.0854535 -0.0992653 -0.0579957 -0.1396121 0.2504349 -0.002118 -0.1382798 -0.2283945 -0.090905 0.114848 0.1005128 0.0362644 -0.2234337 -0.3029141 0.0187923 0.1149364 -0.0101457 0.0158285 -0.016886 0.0469488 -0.0074676 0.1436616 -0.3262333 -0.0359614 -0.0711377 0.3134365 0.1265442 0.0403938 0.0176276 0.0376722 0.0570075 -0.0478292 0.0082927 -0.0344343 0.054775 0.0691258 -0.1335107 -0.1106966 -0.1063167 0.3809096 0.3193924 -0.0150272 0.0067606 0.1107039 0.1352789 0.0212502 -0.0106896 0.0233235 0.0904429 0.0486481 -0.0029901 0.0299972 0.0166101 0.110503 0.0219055 0.0068575 0.0067005 0.0777683 0.0189709 0.0088115 0.0081057 -0.0160928 0.1078529 0.0229694 0.0240723 0.0197062 0.0527642 -0.0474812 0.0163615 -0.0294367 0.0230319 -0.2782509 0.0334699 -0.0055519 0.0230784 -0.363274 0.0222858 0.004447 0.0706451 -0.2634463 0.1433017 -0.0248773 0.0134318 -0.0252052 0.0362327 -0.0464722 -0.0049088 0.0353819 0.1059685 unknown
polarizability: 64.1818848|-8.2673869|113.6125498|3.6229539|3.66087|91.7666379 unknown
InChI: InChI=1/6C.2N.2O.9H
charge 1 multiplicity 1
19 atoms
C  -1.04846086 1.19259336 -0.89749735
N  -0.80530079 2.35399342 -0.43117218
O  0.01995345 2.26644411 0.80933516
H  1.00522813 1.84854819 0.62923941
H  0.06098444 3.18660319 1.11578641
O  2.1786495 1.2169358 0.36638806
H  3.04272488 1.64462152 0.33758791
H  2.28394451 0.29771893 0.64280084
C  -0.65652859 -0.1557011 -0.45007367
C  -0.63183262 -0.546582 0.89413449
C  -0.31800401 -1.09276558 -1.42824108
C  -0.2394972 -1.85026937 1.18788107
H  -0.94134662 0.11971609 1.69046998
C  0.08361665 -2.36328328 -1.01678052
H  -0.35242625 -0.84708561 -2.48476255
H  -0.22454326 -2.19741725 2.21723117
H  0.37261292 -3.11067739 -1.74951654
N  0.13225247 -2.73808774 0.26184855
H  -1.62514047 1.28470959 -1.81907974
