program: Gaussian 09
title: opt freq
version: EM64L-G09RevD.01
method: RwB97XD
basis: 6-31+G(d,p)
operation: Freq
keyword: #P
keyword: Geom=AllCheck
keyword: Guess=TCheck
keyword: SCRF=Check
keyword: GenChk
keyword: RwB97XD/6-31+G(d,p)
keyword: Freq
converged: YES YES NO YES
title: Mulliken charges:
elementType: C N O H H O H H C C C C H C H C H H H H
charge: -0.536290 -0.097866 -0.343769 0.577064 0.407997 -0.756379 0.430222 0.432663 0.505714 -0.305903 -0.302368 -0.082667 0.187517 -0.001598 0.203155 -0.138383 0.197435 0.194680 0.197295 0.231481
chargesum: 1.00000
title: Mulliken charges with hydrogens summed into heavy atoms:
elementType: C N O O C C C C C C
charge: -0.304809 -0.097866 0.641292 0.106506 0.505714 -0.118386 -0.099213 0.114768 0.193082 0.058912
polarizability: 9.56799843e+01 -8.80006286e-01 1.30915453e+02 6.72261175e+00 -1.72216444e+01 6.64896610e+01
1716.lowfreq: -15.8212 -1.8368 -0.0007 0.0006 0.0006 14.0324 24.6022 57.0765 90.0158
frequency: 23.7851 57.0035 89.7209 103.2098 143.9129 192.6053 253.9556 366.5732 408.7464 426.2094 453.8250 484.5995 509.3511 531.5199 596.6742 631.2727 712.2917 734.4223 770.7809 786.0886 881.5883 891.3627 949.1932 989.1692 1021.2306 1025.7449 1055.4923 1065.9675 1129.9732 1142.5582 1210.7441 1231.1971 1240.2736 1298.2963 1363.4354 1383.1659 1434.7893 1502.7860 1547.6816 1634.1932 1654.2273 1661.1914 1678.0193 1745.5850 2082.5018 3196.8422 3220.0514 3222.6564 3239.7111 3247.9704 3257.1599 3623.2028 3852.5526 3958.7742
redmass: 4.5606 2.6238 2.9010 1.4673 3.5494 5.0497 4.6738 1.3715 2.8273 3.3126 3.8457 2.1397 1.4941 1.5891 2.8535 6.2236 3.1310 2.9509 5.3901 1.5117 2.4651 1.4449 1.3728 1.3929 4.3838 1.4670 1.3297 2.2565 1.3985 1.3685 1.1353 1.2729 2.0221 1.5051 2.5792 1.6263 1.0745 2.2210 2.1582 1.1047 2.4937 1.6722 5.2098 4.0850 1.1093 1.0898 1.0906 1.0909 1.0907 1.0951 1.0992 1.0666 1.0438 1.0852
irintensity: 2.4246 1.7829 4.0954 28.2998 7.1123 4.5716 6.8843 163.0782 15.9808 174.5734 145.7947 62.0510 108.0613 12.2943 23.7524 1.0854 34.7994 24.6196 124.2163 31.7652 72.1339 12.6596 14.3109 9.5215 4.7218 0.2119 0.0305 0.2228 37.1754 20.2567 0.9467 21.2729 19.8288 60.6984 3.9804 7.7068 99.4715 13.6315 3.7871 76.3461 91.9730 120.2793 17.3089 56.7214 4837.1412 6.4398 0.0789 0.3840 0.0718 0.8599 0.6866 174.2492 110.6871 213.6225
temp: 298.150 k
press: 1.00000 atm
elementType: 6 7 8 1 1 8 1 1 6 6 6 6 1 6 1 6 1 1 1 1
symmnumber: 1
zpe: 430152.2 jmol-1
zpe.correction: 0.163836 hartree
zpe.thermalcorrener: 0.174564 hartree
zpe.thermalcorrenthalpy: 0.175508 hartree
zpe.thermalcorrgfe: 0.126044 hartree
zpe.sumelectzpe: -477.352252 hartree
zpe.sumelectthermal: -477.341525 hartree
zpe.sumelectthermalent: -477.340581 hartree
zpe.sumelectthermalfe: -477.390045 hartree
dipole: 0.7283 6.5788 0.9456
dipole: 6.6862
quadrupole: -44.9996 2.5050 -57.7996
quadrupole: 4.1324 3.3756 -0.0248
quadrupole: -11.5682 35.9364 -24.3682 4.1324 3.3756 -0.0248
hfenergy: -477.5160888 hartree
pointgroup: C01 [X(C7H10N1O2)]
dipole: 0.1014469 2.5723225 0.5136279 debye
dipolederiv: 0.1874548 -0.2373221 0.0914639 -0.2508822 1.0212046 -0.2701378 0.1118968 -0.3162068 0.2545634 0.3496966 0.5043068 0.4215114 0.1989021 -0.6181352 0.2001844 0.4271661 0.4942686 0.1075113 -0.5719958 -0.4922846 -0.3038661 -0.0183202 -1.2831149 -0.1824967 -0.3952661 -0.5977362 -0.4524029 0.250613 -0.0986814 -0.0556878 0.1106227 2.1611975 0.4011588 -0.0166164 0.515513 0.377245 0.2071179 -0.0308702 -0.0276342 -0.0518376 0.4953235 -0.0029748 -0.006554 -0.0168581 0.2675709 -0.5041964 0.0545213 0.0292217 -0.0421593 -1.2649105 -0.1902685 0.0033754 -0.2770874 -0.6046914 0.3724903 -0.0646063 -0.0249189 -0.0292752 0.3563282 0.0016922 -0.0236992 0.0372493 0.3758208 0.3792002 0.0997892 0.0200279 0.0329245 0.3407285 0.0117308 0.0129918 0.0342463 0.3919022 -0.0495562 0.2911646 -0.1407238 0.136202 -0.461052 0.0937263 -0.1018902 0.2093213 -0.1355999 0.0624364 0.1356775 0.0076513 -0.1575544 0.1082566 -0.0785856 0.0653725 0.0127894 -0.0801684 -0.0196235 -0.2945395 0.0584234 0.0291084 -0.0569988 -0.1049506 -0.0413495 -0.2221712 -0.0148657 -0.1031229 0.1622918 -0.0678887 0.1788575 -0.0141333 -0.0539484 -0.0929189 -0.0657816 -0.0700861 -0.0105577 0.0198704 -0.0179822 0.036347 0.098558 0.0322928 -0.0272734 0.0269292 0.1246233 0.1284899 -0.070108 0.0175839 -0.0570748 -0.2402374 0.065619 0.0200327 0.0708507 -0.1416233 0.0609055 -0.0430965 0.0133512 -0.0439527 0.0477915 0.0553973 0.0232617 0.0735298 0.1066886 0.0623345 -0.0060971 0.0076446 -0.0415249 0.1154119 -0.0975827 0.0270239 -0.0925731 -0.0124584 0.0464245 -0.0403424 0.0203236 -0.0365705 0.0449222 0.0455071 0.0188489 0.0448457 0.1251468 -0.0100488 0.0155605 -0.0052466 0.0051251 0.0889327 0.0236393 -0.0003205 0.0392177 0.1278151 0.0765115 0.0301128 -0.0166648 0.0271852 0.0377361 0.0534408 -0.0174908 0.0570409 0.1121473 0.085426 0.0646531 -0.0265899 -0.0261226 0.0221908 -0.0034438 0.0134092 -0.0273874 0.1408614 unknown
polarizability: 95.6799843|-0.8800063|130.9154526|6.7226117|-17.2216444|66.489661 unknown
InChI: InChI=1/7C.N.2O.10H
charge 1 multiplicity 1
20 atoms
C  -0.89562202 0.48811822 -1.11219492
N  -0.59720145 1.72702586 -1.01341634
O  0.5758141 1.9459329 -0.14297076
H  0.48258642 2.96213526 0.19033963
H  0.62847398 1.28543223 0.5795607
O  0.3086706 4.26371978 0.58485781
H  -0.51122132 4.70435627 0.32979735
H  1.03076485 4.89906935 0.51099512
C  -0.29204356 -0.70017548 -0.49712302
C  -1.16237207 -1.69767366 -0.03226604
C  1.09870491 -0.87800236 -0.39060723
C  -0.64951783 -2.83620376 0.57589187
H  -2.23584342 -1.57629816 -0.14178425
C  1.60098253 -2.03162292 0.20241725
H  1.78553611 -0.15671712 -0.82331396
C  0.72991241 -3.00152503 0.69603373
H  -1.32503626 -3.60023059 0.94415962
H  2.67332801 -2.1791046 0.26745793
H  1.1282749 -3.89767481 1.1594636
H  -1.78599459 0.36897544 -1.73008245
