program: Gaussian 09
title: opt freq
version: EM64L-G09RevD.01
method: RwB97XD
basis: 6-31+G(d,p)
operation: Freq
keyword: #P
keyword: Geom=AllCheck
keyword: Guess=TCheck
keyword: SCRF=Check
keyword: GenChk
keyword: RwB97XD/6-31+G(d,p)
keyword: Freq
converged: YES YES YES YES
title: Mulliken charges:
elementType: C N O H H C H H O C H H H H
charge: -0.026213 -0.076975 -0.364765 0.465397 0.465994 -0.136515 0.197729 0.194672 -0.333765 -0.197220 0.159893 0.201710 0.160720 0.289338
chargesum: 1.00000
title: Mulliken charges with hydrogens summed into heavy atoms:
elementType: C N O C O C
charge: 0.263125 -0.076975 0.566626 0.255886 -0.333765 0.325103
polarizability: 6.70407509e+01 -4.29245939e+00 4.81862317e+01 -2.08856539e-01 9.35571108e-01 3.80655279e+01
1716.lowfreq: -8.5991 -0.0011 0.0003 0.0007 1.4714 22.0296 83.6278 104.4851 144.5407
frequency: 76.3903 103.3456 144.5258 174.2609 222.3969 291.4504 423.3696 430.6094 497.1083 673.3131 807.4816 918.3073 996.5779 1009.5792 1047.7640 1076.0453 1164.8740 1189.5688 1192.7761 1262.4328 1267.4701 1412.1868 1478.9089 1493.6933 1504.7857 1524.9172 1647.0610 1755.9567 2986.7366 3024.1638 3044.1197 3121.1057 3134.6162 3212.2259 3698.0869 3795.2318
redmass: 2.0631 3.1515 3.6585 1.0802 1.1919 4.3931 3.2115 3.3102 8.8683 3.7054 1.1071 1.3511 3.7235 1.2753 3.7300 1.5678 1.4158 1.6167 1.2879 2.9525 1.1036 1.3646 1.0980 1.1027 1.0419 1.0901 1.0832 8.1914 1.0554 1.1027 1.0349 1.1076 1.0869 1.1012 1.0440 1.0859
irintensity: 0.2375 4.5106 1.9433 68.6473 11.4647 3.8959 13.7304 15.1107 140.5872 47.7407 10.3315 160.8880 48.6197 1.3556 23.6289 9.9028 26.5658 46.0909 8.0097 126.6826 2.2516 30.3283 3.6620 19.9765 16.9798 9.5331 148.9897 6.3660 36.1088 11.2134 30.5246 27.2032 67.3444 3.3619 349.8299 287.7187
temp: 298.150 k
press: 1.00000 atm
elementType: 6 7 8 1 1 6 1 1 8 6 1 1 1 1
symmnumber: 1
zpe: 309853.4 jmol-1
zpe.correction: 0.118017 hartree
zpe.thermalcorrener: 0.125858 hartree
zpe.thermalcorrenthalpy: 0.126802 hartree
zpe.thermalcorrgfe: 0.085936 hartree
zpe.sumelectzpe: -323.741494 hartree
zpe.sumelectthermal: -323.733654 hartree
zpe.sumelectthermalent: -323.732710 hartree
zpe.sumelectthermalfe: -323.773575 hartree
dipole: 6.1350 -2.9051 -0.3743
dipole: 6.7984
quadrupole: -4.3101 -29.9369 -31.6706
quadrupole: -5.9986 -0.4871 0.0847
quadrupole: 17.6624 -7.9643 -9.6981 -5.9986 -0.4871 0.0847
hfenergy: -323.8595114 hartree
pointgroup: C01 [X(C3H8N1O2)]
dipole: 2.4140306 -1.1431045 -0.1115371 debye
dipolederiv: 0.0784494 0.2990156 0.0336357 0.1951175 0.1825092 0.0094426 0.0224278 0.0089032 0.159796 0.1924568 -0.5173943 -0.0464688 -0.7515595 0.8040172 0.0842635 -0.0665686 0.0886228 -0.1775409 -0.565036 0.2707227 0.0225348 0.762875 -1.0452747 -0.0631466 0.0697096 -0.0711051 -0.2808682 0.4391966 -0.0278127 -0.0580997 -0.0003309 0.3150027 0.0520462 -0.1611462 0.1242482 0.4471773 0.4317597 -0.0335663 0.0515075 -0.0281326 0.3524589 -0.0714795 0.1583209 -0.144173 0.4159959 0.974186 -0.1931763 -0.0315539 -0.4055153 0.1755974 -0.0282547 -0.0647711 -0.029965 0.4245521 -0.074714 -0.0003144 0.0161888 0.0572068 0.0552972 -0.0338473 0.0881523 -0.0529841 -0.0332102 -0.0705566 0.0059946 -0.0170357 0.0784719 0.02692 0.0479892 -0.0645477 0.072282 -0.0073788 -1.2713206 -0.1185399 -0.0013222 -0.1260849 -0.5468994 -0.0129901 -0.0009586 -0.0102056 -0.4411448 0.7262963 0.2531449 0.0264368 0.4264483 0.4099138 -0.0005483 0.0444546 0.0006748 0.3681829 0.0115464 0.0325194 -0.0655278 -0.0807943 -0.0252726 0.0777378 -0.0069477 0.1079957 -0.0524551 -0.0207328 0.0085461 0.0028515 0.0596 0.0306178 -0.0107369 0.0095764 -0.0100365 0.1056431 0.0137434 0.0117244 0.066591 -0.082555 0.0163906 -0.0579208 -0.016695 -0.0914331 -0.0947363 0.1347254 0.0091363 0.0002621 -0.1047471 0.2487218 0.007445 -0.0110068 0.0071755 0.1659869 unknown
polarizability: 67.0407509|-4.2924594|48.1862317|-0.2088565|0.9355711|38.0655279 unknown
InChI: InChI=1/3C.N.2O.8H
charge 1 multiplicity 1
14 atoms
C  0.65348502 0.8153446 0.05060355
N  1.91434466 0.75428081 0.06500994
O  2.30688524 -0.81841285 -0.08012613
H  2.89192169 -0.85006503 -0.86087035
H  2.85978206 -1.00168429 0.70322581
C  -0.42121992 -0.22512321 -0.07160895
H  -0.29865996 -0.74168555 -1.0397714
H  -0.28360766 -0.97650095 0.72494794
O  -1.62470986 0.453432 0.02939436
C  -2.76381312 -0.39862824 -0.05213393
H  -2.76029754 -1.1312781 0.7636859
H  -3.63418951 0.24781711 0.04196737
H  -2.7943165 -0.91612875 -1.01834991
H  0.34237636 1.86330544 0.14802774
