program: Gaussian 09
title: opt freq
version: EM64L-G09RevD.01
method: RwB97XD
basis: 6-31+G(d,p)
operation: Freq
keyword: #P
keyword: Geom=AllCheck
keyword: Guess=TCheck
keyword: SCRF=Check
keyword: GenChk
keyword: RwB97XD/6-31+G(d,p)
keyword: Freq
converged: YES YES YES YES
title: Mulliken charges:
elementType: C N O H H C H H C H H F H
charge: -0.015544 -0.041777 -0.369833 0.467304 0.466854 -0.356503 0.259342 0.224886 0.013246 0.179084 0.184346 -0.277980 0.266575
chargesum: 1.00000
title: Mulliken charges with hydrogens summed into heavy atoms:
elementType: C N O C C F
charge: 0.251031 -0.041777 0.564324 0.127725 0.376676 -0.277980
polarizability: 5.99276029e+01 -5.12405995e+00 4.60955953e+01 2.64192484e+00 -4.89656432e-02 3.62870389e+01
1716.lowfreq: -16.8935 0.0008 0.0010 0.0014 10.6432 20.2507 70.4119 100.8435 159.0642
frequency: 67.7042 96.7625 158.9739 185.2999 272.8972 408.1659 475.2180 499.6898 672.1705 796.0548 873.0653 923.9607 1003.5912 1046.4343 1060.6848 1120.8718 1136.1046 1231.1510 1257.5638 1307.9083 1338.2832 1443.9287 1477.6312 1539.9389 1650.8135 1745.5302 3071.9250 3085.8093 3120.6009 3148.6051 3183.5984 3693.2530 3789.8087
redmass: 3.1147 2.7561 1.3106 2.7585 3.7473 5.5478 3.3879 5.8196 3.0287 1.2053 1.2133 1.3312 2.1324 1.3977 2.8266 7.1154 2.0449 1.2291 1.2224 1.1334 1.2351 1.2991 1.0870 1.0878 1.0892 7.1675 1.0669 1.0573 1.0858 1.1108 1.0981 1.0439 1.0861
irintensity: 2.9595 6.4016 37.0496 47.4711 10.8248 15.0325 30.1199 83.6177 53.6984 20.2823 11.5949 193.4896 14.3494 16.3340 20.7730 96.0152 2.1199 12.8348 12.5982 3.2882 0.9987 30.1786 16.2119 1.4885 138.5301 18.1232 12.7212 14.1607 35.6209 12.4978 0.5683 357.9961 292.2618
temp: 298.150 k
press: 1.00000 atm
elementType: 6 7 8 1 1 6 1 1 6 1 1 9 1
symmnumber: 1
zpe: 280428.6 jmol-1
zpe.correction: 0.106810 hartree
zpe.thermalcorrener: 0.114140 hartree
zpe.thermalcorrenthalpy: 0.115084 hartree
zpe.thermalcorrgfe: 0.074909 hartree
zpe.sumelectzpe: -347.779512 hartree
zpe.sumelectthermal: -347.772182 hartree
zpe.sumelectthermalent: -347.771238 hartree
zpe.sumelectthermalfe: -347.811413 hartree
dipole: 7.7533 -0.3842 0.2590
dipole: 7.7671
quadrupole: -15.8435 -26.7350 -29.1751
quadrupole: -12.6658 -0.2226 -1.2189
quadrupole: 8.0743 -2.8171 -5.2572 -12.6658 -0.2226 -1.2189
hfenergy: -347.8863215 hartree
pointgroup: C01 [X(C3H7F1N1O1)]
dipole: 3.0751679 -0.1825445 0.124731 debye
dipolederiv: 0.383161 0.2578875 0.0911 0.2973889 0.1380768 0.0438018 0.1621839 0.0437907 0.1560434 0.0116201 -0.4340291 0.0184765 -0.6816143 0.9136787 -0.0682989 -0.0223388 -0.0320411 -0.171171 -0.4795329 0.2492416 -0.0313058 0.6906041 -1.1243684 0.0832125 -0.0096303 -0.00051 -0.2690125 0.4570307 -0.0580113 -0.0479476 -0.0272411 0.3315703 0.0664377 -0.1489609 0.1478524 0.4116924 0.4066342 -0.0199254 0.0452108 -0.0186067 0.3475228 -0.0759579 0.1457071 -0.160081 0.460177 -0.2472005 -0.070545 -0.0117188 0.0306774 -0.0074997 -0.0674418 -0.0195539 -0.0575935 -0.0231981 0.0780598 -0.0017169 0.0103956 -0.0667632 0.1013251 0.026981 0.0521306 0.0240772 0.0704093 0.0035159 0.052483 -0.0045336 0.0146634 0.028357 0.0002398 0.0142819 0.0278533 0.0899298 1.0955546 0.2224355 0.0522018 0.1682408 0.5551511 0.0611884 -0.0101936 0.0820608 0.4698217 0.0086724 -0.0006877 0.0035935 -0.0039054 -0.0860037 -0.0010994 0.003535 0.0451832 0.0466945 -0.0110043 -0.0149732 -0.0295646 0.0077035 0.0482516 0.0359823 -0.0140738 -0.0110969 -0.0738364 -0.7907305 -0.2268491 -0.0848665 -0.3323668 -0.4367474 -0.0905674 -0.1344762 -0.1075515 -0.3028658 0.0842194 0.04469 -0.0110413 -0.0787807 0.1906858 -0.0144782 -0.018611 -0.0019435 0.1353157 unknown
polarizability: 59.9276029|-5.12406|46.0955953|2.6419248|-0.0489656|36.2870389 unknown
InChI: InChI=1/3C.F.N.O.7H
charge 1 multiplicity 1
13 atoms
C  0.69183965 0.86435905 -0.14224884
N  1.91947594 0.68555934 0.1123436
O  2.20448826 -0.90247984 0.10906596
H  2.86015844 -1.0375138 -0.60188893
H  2.65859289 -1.06402791 0.95823389
C  -0.44926398 -0.04233433 -0.43989299
H  -0.66553673 0.07532296 -1.51063972
H  -0.19372707 -1.08615359 -0.25531079
C  -1.71216105 0.35159891 0.34332017
H  -1.99821434 1.3898861 0.14805395
H  -1.58272435 0.1992652 1.41856073
F  -2.72286702 -0.47048302 -0.09320887
H  0.52988853 1.95092531 -0.13633136
