program: Gaussian 09
title: 000052654
version: EM64L-G09RevD.01
frameworkgroup: C1[X(C15H28N2O)]
method: RPBEPBE
basis: SDD
operation: Freq
keyword: #p
keyword: freq=noraman
keyword: PBEPBE/SDD
title: #p freq=noraman PBEPBE/SDD
converged: YES YES NO NO
title: Mulliken charges:
elementType: O N N C C C C C C C C C C C C C C C H H H H H H H H H H H H H H H H H H H H H H H H H H H H
charge: -0.247642 -0.087471 -0.087916 -0.080264 -0.168677 -0.448558 -0.417513 -0.461305 -0.435127 -0.395810 -0.382720 -0.375742 -0.446320 -0.321136 -0.333132 -0.343884 -0.325887 -0.319767 0.214730 0.225069 0.195754 0.221829 0.213284 0.187653 0.195366 0.198179 0.227313 0.196328 0.200476 0.195696 0.196865 0.183930 0.185599 0.205649 0.219675 0.214794 0.204015 0.198563 0.209509 0.185353 0.188837 0.209148 0.211946 0.190522 0.191258 0.211531
chargesum: 0.00000
title: Mulliken charges with hydrogens summed into heavy atoms:
elementType: O N N C C C C C C C C C C C C C C C
charge: -0.247642 -0.087471 -0.087916 0.134466 0.056392 -0.030975 -0.016576 -0.067760 -0.011486 0.000363 -0.001926 0.015506 -0.011851 0.081442 0.061730 0.054102 0.076581 0.083022
polarizability: 2.00014331e+02 -7.00422737e-01 1.60486994e+02 3.94729285e+00 -1.37835609e+00 1.55218047e+02
1716.lowfreq: -20.9692 -13.3445 -8.0331 0.0006 0.0007 0.0009 7.0953 14.0889 19.2630
frequency: -6.6462 9.1973 17.0523 58.0313 87.3742 123.4725 133.9957 152.8876 189.3506 197.8935 233.5423 243.9412 278.5196 302.7274 307.0397 332.9332 354.8135 366.7013 397.2050 404.6665 418.8849 460.1572 466.7070 507.1541 562.0722 607.1113 620.6127 648.5759 752.8446 755.3434 790.5926 804.9846 808.6383 816.4284 839.5187 845.1508 853.3463 878.6616 902.2005 910.1338 935.0547 959.6632 962.6163 982.7254 1004.1419 1017.9458 1025.6229 1027.0726 1051.1045 1057.3799 1063.1870 1070.6869 1085.5228 1093.0134 1098.3349 1107.7272 1120.8960 1124.3424 1128.4767 1135.9120 1149.4573 1164.8177 1180.8749 1186.8520 1195.3872 1210.8033 1226.9512 1233.6830 1243.3869 1249.4711 1257.1144 1265.4879 1271.9529 1286.4306 1290.7773 1301.7357 1305.3816 1315.9779 1319.2416 1326.8998 1333.1873 1334.6168 1337.7301 1343.5857 1345.4450 1355.8789 1360.8437 1363.1362 1370.4865 1378.4418 1391.4367 1441.7396 1444.9332 1449.0609 1456.7918 1458.7340 1462.6638 1464.7163 1469.2474 1469.8150 1475.4683 1478.1935 1488.9768 1498.4088 2809.9674 2839.6326 2846.5048 2856.2327 2876.1512 2894.8564 2951.3969 2955.4504 2956.2115 2960.1701 2966.6472 2971.4959 2972.0672 2982.1161 2985.1940 2997.3470 3000.4972 3006.3117 3008.1963 3015.3781 3022.9092 3025.2425 3030.1242 3039.4120 3041.0077 3050.8156 3077.3166 3080.5532
redmass: 3.2224 3.2228 3.9824 3.5651 3.3775 3.4200 2.5321 2.5931 2.4638 2.9257 1.7858 2.4213 2.3407 2.3077 2.3030 1.8931 1.9786 2.6223 2.3116 2.8817 4.1448 2.2796 2.8166 3.6003 2.6404 1.8764 2.1359 2.9854 2.6941 2.6411 1.9388 2.4903 1.9625 2.2577 1.6018 2.5379 2.4787 2.1214 1.6242 1.8967 2.1010 1.8753 1.6181 1.8057 2.5790 1.9324 1.8767 2.1477 2.1821 2.1385 1.6064 2.1117 1.9803 2.2714 2.1893 1.4265 2.3378 1.6653 2.5385 2.0327 1.7551 1.4611 1.7834 1.0888 2.0028 1.4793 1.4622 1.3293 1.4199 1.3674 1.3624 1.2980 1.3461 1.2077 1.2813 1.4431 1.3730 1.3014 1.3285 1.3815 1.3441 1.4570 1.4688 1.4259 1.3530 1.4376 1.4431 1.4357 1.2710 1.4809 1.4703 1.0819 1.0810 1.0961 1.0941 1.0860 1.0857 1.0809 1.0854 1.0863 1.0882 1.0944 1.0837 1.0899 1.0713 1.0708 1.0709 1.0698 1.0690 1.0696 1.0664 1.0665 1.0700 1.0627 1.0676 1.0661 1.0685 1.0880 1.0675 1.0820 1.0874 1.0872 1.0882 1.0994 1.0889 1.0951 1.1025 1.0891 1.1024 1.1007 1.0960 1.0978
irintensity: 0.0758 0.1014 0.0702 0.1741 0.8088 3.0271 0.7588 0.0513 0.5115 5.3151 2.0969 0.2432 3.5196 4.0574 11.9361 1.0010 0.6025 1.6530 1.3417 0.3409 2.3022 0.3020 1.0398 1.2199 0.5983 4.9118 9.1131 2.9412 1.5155 3.8220 3.4286 5.9395 19.5122 5.5445 0.1471 0.6955 2.8733 5.6534 5.7102 6.4187 7.3565 3.5517 4.4712 4.1325 29.4825 0.4733 3.8108 7.4186 20.3485 4.7402 2.5748 15.6610 16.9405 16.3529 12.9518 4.0357 9.7374 5.2363 44.1095 7.6487 20.6268 14.2325 3.7782 2.4891 39.7513 14.0444 5.8296 8.8709 17.0330 2.6676 3.2899 2.8393 2.7882 8.2623 3.1362 8.5737 4.5523 1.0348 5.0705 6.8395 5.1138 3.2581 4.4492 3.0427 2.3072 1.7928 4.7259 1.6685 2.6187 6.6917 1.9486 2.4091 2.7091 20.3286 5.7669 5.5638 10.6714 0.8216 5.2703 15.1296 2.1993 22.4813 2.2356 7.7453 116.2393 118.7688 54.5613 52.3757 148.2057 95.0728 32.6356 116.3619 8.2562 37.5052 26.6221 79.6508 11.3416 51.2759 21.6550 28.8134 66.6584 16.4515 40.7365 57.3619 49.6500 50.2357 36.3741 43.5888 118.6347 67.2021 44.6542 34.5620
temp: 298.150 k
press: 1.00000 atm
elementType: 8 7 7 6 6 6 6 6 6 6 6 6 6 6 6 6 6 6 1 1 1 1 1 1 1 1 1 1 1 1 1 1 1 1 1 1 1 1 1 1 1 1 1 1 1 1
symmnumber: 1
zpe: 1086611.9 jmol-1
zpe.correction: 0.413869 hartree
zpe.thermalcorrener: 0.430791 hartree
zpe.thermalcorrenthalpy: 0.431735 hartree
zpe.thermalcorrgfe: 0.367158 hartree
zpe.sumelectzpe: -771.613889 hartree
zpe.sumelectthermal: -771.596967 hartree
zpe.sumelectthermalent: -771.596022 hartree
zpe.sumelectthermalfe: -771.660599 hartree
dipole: -2.4854 -1.2875 -0.0258
dipole: 2.7992
quadrupole: -123.7998 -114.0283 -106.7893
quadrupole: -4.6583 -3.6171 -2.5263
quadrupole: -8.9274 0.8442 8.0832 -4.6583 -3.6171 -2.5263
hfenergy: -772.0277578 hartree
pointgroup: C01 [X(C15H28N2O1)]
dipole: 0.9727998 -0.5089624 -0.0862535 debye
polarizability: 200.0161259|-0.4478947|159.7951535|3.9933916|2.2161311|155.9080919 unknown
InChI: InChI=1S/C15H28N2O/c1-2-5-15-13-17(12-14(15)4-1)7-3-6-16-8-10-18-11-9-16/h14-15H,1-13H2
charge 0 multiplicity 1
46 atoms
O  -5.424715 1.300534 -0.11741
N  1.332189 -1.130745 -0.044465
N  -3.059481 -0.345273 0.332286
C  3.701716 -0.67538 -0.3719
C  2.812498 0.343919 -1.156062
C  2.679513 -1.462619 0.507572
C  1.522435 -0.481722 -1.367255
C  4.884866 -0.041324 0.398387
C  2.523459 1.643386 -0.360494
C  4.481333 1.219687 1.197859
C  3.79437 2.251517 0.274386
C  0.338602 -2.214794 0.031738
C  -1.086965 -1.76675 -0.356319
C  -1.60917 -0.614022 0.523951
C  -3.380209 0.200559 -1.012456
C  -3.585479 0.568563 1.380879
C  -4.898305 0.398898 -1.155501
C  -5.101321 0.754382 1.21199
H  4.119025 -1.385791 -1.114457
H  3.2877 0.602073 -2.122722
H  2.889632 -2.556559 0.451754
H  2.73822 -1.171108 1.575652
H  0.653269 0.153177 -1.624725
H  1.66033 -1.224736 -2.195591
H  5.670722 0.245293 -0.330921
H  5.34131 -0.796408 1.069842
H  1.797112 1.404484 0.441533
H  2.037712 2.380287 -1.030668
H  5.377983 1.659549 1.676258
H  3.783965 0.945772 2.015992
H  3.531787 3.164646 0.843241
H  4.505209 2.561827 -0.520469
H  0.628849 -3.085416 -0.616895
H  0.327091 -2.589142 1.075077
H  -1.771987 -2.629853 -0.249565
H  -1.09835 -1.479556 -1.425413
H  -0.989992 0.300978 0.349248
H  -1.463777 -0.893683 1.58606
H  -3.040083 -0.507742 -1.789496
H  -2.863228 1.179918 -1.187317
H  -3.089404 1.572191 1.338032
H  -3.377087 0.128874 2.375165
H  -5.148161 0.878916 -2.116417
H  -5.406601 -0.58736 -1.085754
H  -5.61249 -0.223306 1.34806
H  -5.497895 1.485757 1.93581
