program: Gaussian 09
title: opt freq
version: EM64L-G09RevD.01
method: RwB97XD
basis: 6-31+G(d,p)
operation: Freq
keyword: #P
keyword: Geom=AllCheck
keyword: Guess=TCheck
keyword: SCRF=Check
keyword: GenChk
keyword: RwB97XD/6-31+G(d,p)
keyword: Freq
converged: YES YES YES YES
title: Mulliken charges:
elementType: C N O H H H H
charge: -0.149991 0.004203 -0.353580 0.475132 0.475131 0.264739 0.284366
chargesum: 1.00000
title: Mulliken charges with hydrogens summed into heavy atoms:
elementType: C N O
charge: 0.399114 0.004203 0.596683
polarizability: 3.37418442e+01 -6.72430453e-01 1.92194561e+01 -1.82198620e+00 -2.12498054e+00 1.67302455e+01
1716.lowfreq: -0.0010 -0.0009 0.0014 10.8754 26.1016 53.1675 201.2246 476.6508 579.5709
frequency: 201.1933 476.6480 579.5696 731.4709 923.4689 1072.5506 1084.2742 1103.0085 1388.3343 1652.8122 1733.5661 3144.5030 3264.8056 3671.2230 3766.2369
redmass: 1.1449 3.1189 4.1274 1.0558 1.1901 1.1713 1.6309 1.3326 1.1253 1.0977 5.2757 1.0592 1.1254 1.0436 1.0866
irintensity: 113.1638 76.6145 61.4455 1.8850 211.2062 0.2638 37.0508 39.6011 23.9306 145.2244 1.1781 47.2845 44.4633 321.6531 324.1617
temp: 298.150 k
press: 1.00000 atm
elementType: 6 7 8 1 1 1 1
symmnumber: 1
zpe: 148299.0 jmol-1
zpe.correction: 0.056484 hartree
zpe.thermalcorrener: 0.060530 hartree
zpe.thermalcorrenthalpy: 0.061474 hartree
zpe.thermalcorrgfe: 0.031495 hartree
zpe.sumelectzpe: -169.997299 hartree
zpe.sumelectthermal: -169.993253 hartree
zpe.sumelectthermalent: -169.992309 hartree
zpe.sumelectthermalfe: -170.022289 hartree
dipole: 1.2653 -1.4846 -0.0860
dipole: 1.9525
quadrupole: -1.1339 -16.1637 -14.7668
quadrupole: -0.2546 -1.6192 1.4037
quadrupole: 9.5543 -5.4756 -4.0786 -0.2546 -1.6192 1.4037
hfenergy: -170.0537834 hartree
pointgroup: C01 [X(C1H4N1O1)]
dipole: 0.5520208 -0.4194584 0.1696242 debye
dipolederiv: -0.0063232 0.0295838 0.0017899 -0.0712157 0.1691712 -0.0026944 0.0578681 -0.0144238 0.1505255 0.9343791 -0.3315933 0.0554254 -0.4747183 0.1224115 -0.1108283 0.1349715 -0.1275983 -0.1174563 -1.1463527 0.2269818 -0.0247107 0.5039478 -0.406222 0.0131619 -0.1785206 0.0459133 -0.280683 0.3791642 -0.0163835 -0.0790754 -0.0509686 0.4185368 0.0634057 -0.1934261 0.0759906 0.4366599 0.4388816 0.058489 0.0680719 0.1406685 0.3498563 0.0153548 0.1550251 0.0083719 0.4455838 0.1490892 0.0503179 -0.0215457 0.0277777 0.1876371 0.0060863 -0.0085843 0.0031873 0.2036204 0.2511618 -0.0173955 0.0000446 -0.0754913 0.1586092 0.0155139 0.0326663 0.0085588 0.1617497 unknown
polarizability: 33.7418442|-0.6724305|19.2194561|-1.8219862|-2.1249805|16.7302455 unknown
InChI: InChI=1/C.N.O.4H
charge 1 multiplicity 1
7 atoms
C  -1.22091036 -0.1450464 0.06758201
N  -0.21980592 0.46460173 -0.39708368
O  1.0481079 -0.42488093 -0.04482572
H  1.47997096 -0.61527838 -0.90186882
H  1.64435252 0.16100136 0.46345179
H  -1.20669652 -1.09364087 0.60157716
H  -2.15539497 0.38724688 -0.12191412
