program: Gaussian 09
title: opt freq
version: EM64L-G09RevD.01
method: RwB97XD
basis: 6-31+G(d,p)
operation: Freq
keyword: #P
keyword: Geom=AllCheck
keyword: Guess=TCheck
keyword: SCRF=Check
keyword: GenChk
keyword: RwB97XD/6-31+G(d,p)
keyword: Freq
converged: YES YES NO YES
title: Mulliken charges:
elementType: C C C C C C H H H H C H C C C C H C H C H H H C C N
charge: 0.469652 -0.084660 0.060107 -0.332667 0.055820 -0.078961 0.232413 0.224018 0.224381 0.232405 0.239715 0.246624 0.663146 -0.428119 -0.078330 -0.327378 0.151928 -0.180881 0.171910 -0.141014 0.187449 0.191636 0.191333 -0.194806 -0.351110 -0.344612
chargesum: 1.00000
title: Mulliken charges with hydrogens summed into heavy atoms:
elementType: C C C C C C C C C C C C C C C N
charge: 0.469652 0.147753 0.284125 -0.332667 0.280201 0.153444 0.239715 0.663146 -0.276192 0.093580 -0.139929 0.010755 0.050319 0.051818 -0.351110 -0.344612
polarizability: 1.27276190e+02 1.78410633e+01 3.60218469e+02 -2.22297632e+00 -2.08335969e-01 1.16394574e+02
1716.lowfreq: -6.9185 -4.9336 0.0003 0.0005 0.0007 1.8144 28.4662 34.3814 50.2616
frequency: 28.3928 32.3403 50.2280 85.0690 113.2795 166.1529 187.2192 253.8929 279.4694 349.8643 393.1003 409.8057 419.4362 476.3790 479.9927 494.6029 555.8535 560.6593 627.3330 640.3780 652.7579 700.5628 712.8482 752.1909 768.1588 818.5022 850.2739 851.6092 863.6977 873.1437 886.8600 962.5207 1016.6189 1023.6137 1024.9845 1028.2062 1030.7108 1044.2548 1063.4475 1125.0367 1150.7317 1156.1032 1194.6068 1203.5605 1219.3940 1230.1436 1241.6708 1330.2411 1334.7514 1364.1589 1372.7962 1381.4115 1466.2694 1506.4548 1532.2149 1550.0833 1573.3284 1662.1746 1672.9406 1677.1717 1948.4496 2393.9350 3124.5788 3205.2430 3225.1128 3238.4336 3245.9487 3249.4704 3250.0082 3256.5793 3261.8929 3263.7798
redmass: 7.0097 4.2541 4.3422 7.1882 5.7224 6.5770 6.8587 5.8555 2.9889 6.7397 2.9184 2.8548 6.2635 6.8466 8.1212 2.8483 7.1026 3.1566 6.1335 5.5441 7.3150 2.2157 5.0903 4.9410 1.3764 5.7843 3.7503 1.5579 1.3023 1.2830 1.6512 1.3647 1.3702 6.0238 1.3373 1.3909 2.7851 1.3318 2.3091 1.5758 1.4539 1.3752 2.0329 1.1259 1.4993 1.1790 2.6723 3.6132 1.3860 5.8960 3.8927 1.4704 3.0476 2.2740 2.2708 2.2691 5.7216 5.7524 5.5106 5.4663 11.0732 12.6771 1.0838 1.0914 1.0900 1.0910 1.0949 1.0917 1.0911 1.0989 1.0982 1.0990
irintensity: 1.8676 0.3032 0.2989 1.9986 2.8908 3.0561 3.0636 1.3453 6.1128 0.5530 0.2385 0.0006 0.8342 0.4004 17.4676 16.1230 0.0292 29.1060 4.2049 11.0280 3.0961 25.9016 4.9186 0.4914 38.3376 16.6216 2.5501 16.1319 4.1878 6.2059 62.5037 2.6330 0.5195 13.8900 0.3280 0.0486 11.3973 0.0986 2.9942 10.3668 41.6611 1.0369 54.9882 0.8665 98.6472 1.1975 1.9914 202.1593 1.9782 44.5888 14.3985 51.7461 79.3616 19.5654 17.8475 2.6496 3.0462 1.5372 481.2382 177.4129 530.2529 68.9631 83.3630 5.1743 1.5416 0.3520 3.0980 3.1861 1.6325 2.1498 9.2210 1.6162
temp: 298.150 k
press: 1.00000 atm
elementType: 6 6 6 6 6 6 1 1 1 1 6 1 6 6 6 6 1 6 1 6 1 1 1 6 6 7
symmnumber: 1
zpe: 533158.2 jmol-1
zpe.correction: 0.203069 hartree
zpe.thermalcorrener: 0.216120 hartree
zpe.thermalcorrenthalpy: 0.217065 hartree
zpe.thermalcorrgfe: 0.161174 hartree
zpe.sumelectzpe: -631.622233 hartree
zpe.sumelectthermal: -631.609182 hartree
zpe.sumelectthermalent: -631.608238 hartree
zpe.sumelectthermalfe: -631.664128 hartree
dipole: 2.2463 1.8091 -0.4207
dipole: 2.9147
quadrupole: -78.5549 -56.3631 -80.5865
quadrupole: -3.6699 -0.6179 0.8293
quadrupole: -6.7201 15.4717 -8.7516 -3.6699 -0.6179 0.8293
hfenergy: -631.8253025 hartree
pointgroup: C01 [X(C15H10N1)]
dipole: 0.884399 0.7080863 -0.1414414 debye
dipolederiv: 0.2632544 0.2513431 0.0719396 0.1925148 1.2407842 -0.0250275 0.0716274 -0.0347873 0.6717076 -0.1625912 -0.2911024 -0.1405428 -0.2110858 -0.9241254 -0.51465 -0.1048796 -0.5030425 -0.1550324 0.0617786 0.1023112 0.0840122 0.239268 0.9685681 0.341503 -0.0750277 -0.7806446 -0.0134003 -0.0960551 -0.5844364 0.0313523 -0.3561922 -2.4814692 0.0275999 0.0343121 0.073662 0.133532 0.0527011 0.3553434 -0.0986043 0.1188668 0.9613931 -0.3780564 0.059028 0.7253379 0.0077569 -0.0876677 -0.1193046 0.1163944 -0.0398363 -0.9464995 0.5378042 0.0825673 0.553653 -0.2075555 0.1506702 -0.0209426 -0.0073163 -0.0121147 0.0666073 0.0105621 -0.0061249 0.0036679 0.0915815 0.1289613 -0.0191081 -0.0092503 -0.0240348 0.0924868 -0.0196672 -0.0022423 -0.0215704 0.0929481 0.1288249 -0.0115724 -0.0025673 -0.0165203 0.0913642 0.0254957 -0.010222 0.0259632 0.0944711 0.1485626 -0.0210853 -0.0122757 -0.0150116 0.0664666 -0.0073119 -0.0135188 0.0028597 0.0934472 0.2222239 0.8059493 -0.033813 0.5545356 2.2781431 -0.0639509 -0.0345098 -0.1143997 -0.0430112 0.1737217 0.1759515 0.000256 -0.0538224 0.0418666 0.0076885 -0.0022623 -0.0338461 0.1596562 -0.0809762 0.290187 0.0135093 0.1416377 -0.0812024 -0.0246423 0.0106396 -0.043216 -0.0199024 -0.0045186 -0.3504615 -0.0195462 0.0387848 -0.0156154 -0.0083314 -0.016481 0.0594643 -0.0888815 0.0782972 0.2701659 -0.0270033 -0.1623108 0.1697785 0.0310755 -0.0294118 -0.0486263 -0.0866419 0.1253129 0.0281004 -0.0408399 0.0207739 -0.3966242 -0.0067582 -0.0402942 -0.0055477 -0.094222 0.062181 -0.0727717 0.0091769 -0.0527555 -0.0575235 0.009422 0.0098235 0.0147255 0.1166433 -0.1671476 0.167647 0.0115379 0.1392796 0.0732772 -0.0244424 0.0101152 -0.030881 -0.1101642 -0.0426518 0.0035993 0.0327233 0.0343022 0.1116749 -0.0056863 0.0326981 -0.0001983 0.1343429 0.0725962 0.0339878 -0.0256519 -0.0572717 0.1259532 0.0105631 -0.0265606 -0.0069579 -0.0712184 -0.0182472 0.0102372 0.0293989 -0.0175278 0.0543664 0.0028163 0.028898 -0.0018022 0.137454 0.0628409 -0.0295485 0.0149169 -0.0377645 -0.0207572 0.005937 0.0146558 0.0053547 0.1433431 0.0560851 0.0518199 0.0152396 0.0467937 0.0110985 -0.0087772 0.0152335 -0.0094613 0.1368116 0.0019136 -0.9095015 -0.0074756 -0.3896894 0.1462698 0.0680171 -0.0028968 0.1558118 0.0310567 0.0689602 -0.2319791 -0.0059702 -0.1835767 -0.8182789 0.020505 -0.0054833 0.0279799 0.0500356 -0.1990302 0.1151713 0.0003994 0.1027572 0.2419973 -0.0116877 0.0003166 -0.0134984 -0.2047576 unknown
polarizability: 127.2761897|17.8410633|360.2184689|-2.2229763|-0.208336|116.3945737 unknown
InChI: InChI=1/15C.N.10H
charge 1 multiplicity 1
26 atoms
C  -0.08086754 -3.76024813 -0.04633698
C  0.28156817 -3.11196249 1.15077371
C  0.61185864 -1.77637677 1.11611331
C  0.58134342 -1.07031242 -0.12603617
C  0.20994525 -1.74961932 -1.32729343
C  -0.11816081 -3.08547984 -1.28253488
H  0.29737651 -3.66739308 2.08122666
H  0.89536417 -1.24837421 2.02022108
H  0.19104697 -1.20190426 -2.26336129
H  -0.40211779 -3.62141438 -2.18067719
C  0.90008138 0.2569323 -0.16268433
H  2.29673086 1.66742243 -0.37496263
C  0.37811489 2.70039851 -0.04045063
C  -0.99735646 2.5913357 0.20773722
C  0.97746175 3.95999781 -0.1443951
C  -1.7620818 3.73982909 0.34920673
H  -1.46879913 1.61591016 0.29259249
C  0.20273294 5.10653393 -0.00171131
H  2.04291189 4.04652691 -0.33512315
C  -1.16324605 4.99696929 0.24401414
H  -2.82625573 3.65781223 0.54106239
H  0.66733328 6.08278274 -0.08360124
H  -1.76513841 5.89243535 0.35526893
C  1.22687949 1.50806408 -0.19851102
C  -0.42392665 -5.15256151 -0.0056122
N  -0.70155045 -6.27682394 0.0271454
