program: Gaussian 09
title: opt freq
version: EM64L-G09RevD.01
method: RwB97XD
basis: 6-31+G(d,p)
operation: Freq
keyword: #P
keyword: Geom=AllCheck
keyword: Guess=TCheck
keyword: SCRF=Check
keyword: GenChk
keyword: RwB97XD/6-31+G(d,p)
keyword: Freq
converged: YES YES YES YES
title: Mulliken charges:
elementType: C N C H H H C C H H H C H H H C H H H
charge: 0.009509 0.266587 -0.386348 0.241713 0.241708 0.372254 -0.106606 -0.459555 0.179522 0.200578 0.179521 -0.407291 0.181820 0.152712 0.203391 -0.407410 0.181807 0.203405 0.152684
chargesum: 1.00000
title: Mulliken charges with hydrogens summed into heavy atoms:
elementType: C N C C C C C
charge: 0.381763 0.266587 0.097072 -0.106606 0.100066 0.130632 0.130486
polarizability: 6.08313140e+01 -4.77714847e-02 8.49752763e+01 1.36276083e-02 -6.98874527e+00 6.37066883e+01
1716.lowfreq: -12.2734 -8.9214 -0.0011 -0.0011 -0.0004 26.4879 83.7162 154.0818 206.4709
frequency: 82.7959 154.0815 206.3193 268.9494 272.1745 307.4270 324.7073 364.9247 387.3647 411.6329 419.9370 547.8586 761.3815 772.2474 786.8105 865.4346 893.2144 906.7672 958.6210 959.1568 981.9760 1057.2045 1075.8222 1246.7608 1249.5458 1273.8500 1340.4612 1353.6581 1427.7562 1433.1103 1462.1859 1467.6111 1486.2563 1490.2546 1494.6403 1521.8392 1523.7423 1526.9831 2369.4144 3056.3650 3059.4316 3065.4159 3092.9222 3133.1669 3135.6708 3147.3616 3160.1935 3162.2295 3162.5340 3165.7683 3427.4838
redmass: 2.4607 3.3373 1.0721 1.0487 1.0700 2.6181 2.7758 2.1714 3.0742 2.3622 2.0133 3.1960 3.5283 1.3263 1.3153 5.8427 1.6112 2.2244 1.5359 1.5765 1.2139 1.4434 1.4168 2.2852 1.7137 2.9110 1.4448 1.2956 1.2292 1.2529 1.1904 1.0915 1.0420 1.0403 1.0440 1.0553 1.0625 1.0641 4.5448 1.0388 1.0388 1.0375 1.0572 1.1020 1.1018 1.1039 1.1077 1.1021 1.1020 1.1007 1.2332
irintensity: 3.9009 14.6673 0.7783 0.0053 0.7934 6.3277 4.1612 14.3854 3.0602 2.9943 0.3080 10.0156 2.4780 33.0604 31.7344 0.3350 0.1869 0.9482 0.6501 1.6974 0.1236 0.6660 0.0247 15.1341 0.0325 17.4440 4.4073 7.0515 13.9044 20.6765 12.5165 5.4453 1.2876 0.0097 0.0259 23.6406 12.7423 17.3864 35.2338 17.1206 25.2167 3.8167 4.4378 5.3431 35.4904 15.8014 2.1630 2.0478 1.5091 15.9430 265.7310
temp: 298.150 k
press: 1.00000 atm
elementType: 6 7 6 1 1 1 6 6 1 1 1 6 1 1 1 6 1 1 1
symmnumber: 1
zpe: 449816.3 jmol-1
zpe.correction: 0.171326 hartree
zpe.thermalcorrener: 0.180002 hartree
zpe.thermalcorrenthalpy: 0.180946 hartree
zpe.thermalcorrgfe: 0.139127 hartree
zpe.sumelectzpe: -290.076345 hartree
zpe.sumelectthermal: -290.067670 hartree
zpe.sumelectthermalent: -290.066726 hartree
zpe.sumelectthermalfe: -290.108544 hartree
dipole: 0.0157 -6.8610 -0.3989
dipole: 6.8726
quadrupole: -40.4175 -11.4250 -37.6997
quadrupole: -0.0601 0.0062 -2.9210
quadrupole: -10.5701 18.4224 -7.8523 -0.0601 0.0062 -2.9210
hfenergy: -290.2476714 hartree
pointgroup: C01 [X(C6H12N1)]
dipole: 0.0051852 -2.6916126 -0.1632967 debye
dipolederiv: 0.2360544 0.0005972 -0.0001516 0.0005958 -0.0653684 0.0862451 -0.0004801 0.2515451 0.1825873 -0.0165437 -0.0000062 -0.00003 -0.0000288 -0.0134441 -0.0074217 0.0003022 -0.1748587 -0.0315106 0.0920748 -0.0002732 0.0001231 -0.0001846 0.2148296 -0.058538 0.0002526 -0.1196546 0.0790277 0.0532949 -0.0565505 -0.0435671 -0.0253258 0.0223476 0.0150001 -0.0156069 0.0133459 0.1071225 0.0529667 0.0566977 0.0435091 0.0254568 0.0225919 0.0151755 0.0155519 0.0134052 0.10711 0.2523757 -0.0005381 0.0002107 -0.0005625 0.5188651 -0.0986115 0.0002684 -0.1198631 0.3017311 0.1516164 -0.0002849 -0.0002071 -0.0003596 0.3188251 0.1082873 -0.0006717 0.3433863 0.1231993 0.0493493 0.0001467 0.0000315 0.0001556 -0.0407851 -0.0187738 0.0002324 -0.1285246 0.0286851 -0.0521928 0.0083536 -0.1057516 -0.0372897 0.0654029 -0.0043389 -0.0764342 0.0355844 0.0117683 0.0966695 0.0002139 0.0000767 0.0002071 -0.0276324 -0.0321874 0.0001418 -0.0741912 -0.0004023 -0.0523725 -0.0087489 0.1057529 0.0369193 0.0654532 -0.0039894 0.0762929 0.0358338 0.0118359 0.0105698 -0.0105783 0.02665 -0.0076704 -0.0200606 -0.0481896 0.0166885 -0.0745156 0.0057964 -0.0597397 -0.0064585 -0.0469415 -0.0076136 0.0900851 0.0044581 -0.113656 0.0050468 -0.011628 0.0422984 0.0316077 -0.001523 -0.022723 -0.0933596 0.1294717 0.0263267 0.097445 0.0090747 0.0753189 -0.0248723 -0.0116996 0.0063844 -0.0172683 -0.0862373 0.0195377 -0.0660608 0.0361736 0.0105077 0.0106857 -0.0265117 0.0078572 -0.0199997 -0.0482808 -0.0164601 -0.0745424 0.0058087 -0.059843 0.0060575 0.0469305 0.0071888 0.0901115 0.0045914 0.113634 0.0053812 -0.0116103 0.0753086 0.0251744 0.0119665 -0.0060998 -0.0172302 -0.0861884 -0.0193 -0.0661137 0.0362068 0.0422866 -0.0312236 0.0011321 0.0230929 -0.0933637 0.1295276 -0.02662 0.097351 0.0090239 unknown
polarizability: 60.831314|-0.0477715|84.9752763|0.0136276|-6.9887453|63.7066883 unknown
InChI: InChI=1/6C.N.12H
charge 1 multiplicity 1
19 atoms
C  0.00573199 -2.73341603 0.18815447
N  0.00362667 -1.72689137 -0.34753268
C  0.00113702 -0.4346017 -0.98739201
H  -0.8917364 -0.42428902 -1.62014012
H  0.89385838 -0.42105417 -1.62029267
H  0.00783352 -3.68890565 0.68734852
C  -0.00086395 0.72737342 0.03827046
C  -0.00275308 2.00681122 -0.81382487
H  -0.89178779 2.06990501 -1.44922894
H  -0.00429947 2.87850757 -0.15478143
H  0.88634463 2.07278299 -1.44883931
C  -1.26423053 0.66437855 0.90431113
H  -2.17455777 0.69152729 0.29673748
H  -1.29152717 -0.23202045 1.53424272
H  -1.29033142 1.52467947 1.57763866
C  1.26248079 0.66832757 0.90462997
H  2.17287113 0.69799851 0.29726623
H  1.28592533 1.52887377 1.57774222
H  1.29224001 -0.22782587 1.53479036
