program: Gaussian 09
title: opt freq
version: EM64L-G09RevD.01
method: RwB97XD
basis: 6-31+G(d,p)
operation: Freq
keyword: #P
keyword: Geom=AllCheck
keyword: Guess=TCheck
keyword: SCRF=Check
keyword: GenChk
keyword: RwB97XD/6-31+G(d,p)
keyword: Freq
converged: YES YES YES YES
title: Mulliken charges:
elementType: C C C C C C H H H H C H C C C C H C H C H H H C O C H H H
charge: -0.383512 0.075206 -0.117343 -0.221830 -0.527130 0.594924 0.216175 0.214664 0.213846 0.195745 0.123264 0.228751 0.596203 -0.452666 -0.016018 -0.344290 0.149034 -0.177303 0.166772 -0.143800 0.180135 0.185091 0.184367 -0.100898 -0.264769 -0.159035 0.187192 0.210617 0.186607
chargesum: 1.00000
title: Mulliken charges with hydrogens summed into heavy atoms:
elementType: C C C C C C C C C C C C C C O C
charge: -0.383512 0.291381 0.097321 -0.221830 -0.313284 0.790668 0.123264 0.596203 -0.303631 0.150753 -0.164155 0.007788 0.040567 0.127853 -0.264769 0.425382
polarizability: 1.32064689e+02 1.67564506e+01 3.52159819e+02 -5.03822922e+00 -5.63109510e+00 1.19518496e+02
1716.lowfreq: -10.8520 -0.0003 0.0009 0.0010 9.0214 13.3820 34.0639 37.5039 54.6146
frequency: 33.3400 35.1795 54.4633 86.4998 125.0041 154.0920 225.9533 236.6563 267.9567 273.6307 296.5905 399.3748 408.6819 414.7127 461.8198 493.7517 513.3885 526.2980 541.5032 633.0661 637.3948 655.3065 708.4486 736.8453 761.4576 775.5013 823.1686 825.8242 848.0298 869.7332 878.2736 882.9274 964.3959 1003.1609 1015.1309 1015.8360 1022.2531 1024.0220 1045.1883 1045.4096 1064.9662 1126.6670 1149.8576 1171.8674 1172.9690 1198.0376 1202.1982 1216.1049 1219.0343 1229.1838 1320.2588 1340.8266 1372.3674 1374.2044 1384.5604 1408.8236 1485.5359 1507.8277 1511.1538 1518.5602 1527.0765 1551.0751 1575.9319 1582.6500 1665.2185 1680.3412 1686.3352 1987.6439 3082.7779 3145.4976 3179.7270 3206.0157 3213.6991 3226.0983 3230.1349 3237.9781 3245.4378 3247.6175 3247.8914 3262.8552 3265.2017
redmass: 4.7132 3.9848 4.2525 4.3311 4.6624 4.2030 1.5629 3.2001 2.3707 4.1420 3.0998 5.5380 3.0994 2.8823 5.6490 5.2358 3.0365 2.6557 4.6532 6.4418 6.7095 5.3719 2.1594 4.1496 5.1950 1.4111 1.4681 3.7423 4.5897 1.3312 1.8050 1.4052 1.3827 2.6227 1.3186 1.3709 1.3329 6.0989 7.6179 1.3263 2.2723 1.5846 1.3332 1.4715 1.2811 1.3058 1.1313 1.3352 1.8321 1.1814 1.4253 3.0435 3.4489 2.4341 1.6682 2.8054 1.3083 1.4073 1.4863 1.0859 4.8980 2.2776 3.7177 4.6933 5.7605 5.6402 5.7213 11.1751 1.0319 1.0857 1.1097 1.0901 1.0907 1.0905 1.1052 1.0953 1.0912 1.0987 1.0911 1.0978 1.0968
irintensity: 0.2542 0.1235 0.6393 0.3696 0.3346 2.8520 1.8716 2.7520 1.5092 4.3720 3.8017 0.0964 1.0863 0.0819 0.1214 8.0052 22.6446 20.3388 48.8038 0.8410 8.4000 1.0833 26.9337 12.1040 6.2941 40.8269 5.9092 31.8171 6.4141 5.3939 73.2055 21.8255 3.0834 0.4430 0.1488 0.4132 0.0518 10.4602 71.0461 0.0097 5.5189 14.0213 9.9679 116.8686 5.2998 145.1222 0.3392 2.9363 80.0834 0.8548 6.0230 56.2469 8.9055 4.7028 40.9442 695.5988 24.7504 2.7490 86.4417 20.8591 60.0137 13.8225 350.2054 46.4947 0.5911 158.0523 828.0616 363.8667 21.5130 41.7068 6.8936 5.8911 3.0116 0.4878 1.4041 5.3926 1.7769 5.1574 0.4848 3.9207 1.4220
temp: 298.150 k
press: 1.00000 atm
elementType: 6 6 6 6 6 6 1 1 1 1 6 1 6 6 6 6 1 6 1 6 1 1 1 6 8 6 1 1 1
symmnumber: 1
zpe: 626499.2 jmol-1
zpe.correction: 0.238621 hartree
zpe.thermalcorrener: 0.252216 hartree
zpe.thermalcorrenthalpy: 0.253160 hartree
zpe.thermalcorrgfe: 0.196630 hartree
zpe.sumelectzpe: -653.911597 hartree
zpe.sumelectthermal: -653.898002 hartree
zpe.sumelectthermalent: -653.897058 hartree
zpe.sumelectthermalfe: -653.953588 hartree
dipole: 0.1509 -5.2770 -1.4467
dipole: 5.4738
quadrupole: -80.1379 -10.5882 -84.1666
quadrupole: 8.0261 -0.3961 5.1757
quadrupole: -21.8404 47.7093 -25.8690 8.0261 -0.3961 5.1757
hfenergy: -654.1502181 hartree
pointgroup: C01 [X(C15H13O1)]
dipole: 0.0808695 -2.1056847 -0.5732379 debye
polarizability: 132.0646892|16.7564506|352.1598185|-5.0382292|-5.6310951|119.5184962 unknown
InChI: InChI=1/15C.O.13H
charge 1 multiplicity 1
29 atoms
C  -0.00488032 -3.56659825 0.22716687
C  0.67077258 -2.8441989 1.25284341
C  0.96694779 -1.52972158 1.069724
C  0.60045726 -0.86342399 -0.15651039
C  -0.08085665 -1.61616746 -1.17601584
C  -0.378235 -2.93620574 -0.99244088
H  0.9313606 -3.37267825 2.16236362
H  1.48043538 -0.96318657 1.8391636
H  -0.35407637 -1.11380428 -2.09811602
H  -0.89020007 -3.490616 -1.76845198
C  0.88451467 0.43947947 -0.34903617
H  2.14963493 1.86775709 -0.99789806
C  0.36071172 2.87155445 -0.19414489
C  -0.91404451 2.74623475 0.37391919
C  0.89048866 4.14107478 -0.44525719
C  -1.64551022 3.88305163 0.6875721
H  -1.33507914 1.7634999 0.56866971
C  0.1524816 5.27723212 -0.12749095
H  1.87711425 4.24276092 -0.88758533
C  -1.11273916 5.1492707 0.4386225
H  -2.63158127 3.78472364 1.12850825
H  0.56809658 6.25998456 -0.32105162
H  -1.68677387 6.03575868 0.68658791
C  1.17532813 1.69114794 -0.53461829
O  -0.24325214 -4.8224853 0.50112372
C  -0.9255668 -5.67622817 -0.43362784
H  -0.35000668 -5.76057025 -1.35823799
H  -0.98387459 -6.64348358 0.05878086
H  -1.93029044 -5.29342501 -0.62677526
