program: Gaussian 09
title: opt freq calcfc
version: EM64L-G09RevD.01
method: RwB97XD
basis: 6-31+G(d,p)
operation: Freq
keyword: #P
keyword: Geom=AllCheck
keyword: Guess=TCheck
keyword: SCRF=Check
keyword: GenChk
keyword: RwB97XD/6-31+G(d,p)
keyword: Freq
converged: YES YES YES YES
title: Mulliken charges:
elementType: C N C H H C H H C F F F O C H H H
charge: 0.481351 0.005068 0.086051 0.206360 0.205435 -0.649776 0.300448 0.298532 0.860682 -0.255352 -0.247885 -0.247802 -0.352898 -0.240266 0.171118 0.208445 0.170489
chargesum: 1.00000
title: Mulliken charges with hydrogens summed into heavy atoms:
elementType: C N C C C F F F O C
charge: 0.481351 0.005068 0.497846 -0.050797 0.860682 -0.255352 -0.247885 -0.247802 -0.352898 0.309787
polarizability: 5.71226478e+01 4.29445348e-01 5.19567053e+01 -8.27788910e+00 2.54700913e-01 9.30060768e+01
1716.lowfreq: -0.0014 -0.0012 -0.0010 3.7030 8.4988 29.1335 38.4887 55.0545 68.0296
frequency: 29.0171 54.1884 67.1939 76.7698 117.4539 200.1622 228.4418 293.8835 316.3595 356.1817 414.0387 468.3032 501.4725 535.3490 555.4490 680.0775 811.3634 856.0330 923.3528 1014.0007 1073.0953 1106.8456 1171.5982 1176.1068 1185.1715 1227.1333 1253.6468 1266.7429 1276.2138 1317.7912 1381.5499 1439.3302 1450.0795 1490.1029 1505.3411 1511.2546 1533.8600 2534.2632 3028.1798 3054.4994 3082.4494 3098.2150 3138.0585 3164.2806 3220.2081
redmass: 4.0841 6.2855 5.3968 2.8366 7.2242 2.6616 1.2334 8.5709 4.0695 3.6779 3.3603 9.2948 8.5443 8.1469 9.1606 7.1355 4.8770 6.5432 2.0280 4.8380 4.4489 1.4963 1.7027 2.2110 1.2877 3.7176 2.8441 6.8680 1.1033 2.2854 2.0983 1.2071 1.0913 1.1325 1.0433 1.0620 1.0927 12.5689 1.0534 1.0338 1.1108 1.0598 1.1087 1.1064 1.1027
irintensity: 2.8088 4.1501 5.1434 15.8144 1.4594 1.4215 6.5912 2.1695 1.7832 4.3961 1.0398 11.5066 7.2885 0.6099 2.0507 13.7849 14.1986 8.5047 6.2083 65.8916 33.5408 5.1847 108.6691 171.9129 7.7392 300.8667 58.9656 219.3708 10.1902 184.5175 163.7293 60.6682 20.9385 6.9977 17.9279 9.6085 6.9777 177.8401 17.3559 27.1365 2.5239 35.0964 18.6316 27.7787 0.9614
temp: 298.150 k
press: 1.00000 atm
elementType: 6 7 6 1 1 6 1 1 6 9 9 9 8 6 1 1 1
symmnumber: 1
zpe: 330080.3 jmol-1
zpe.correction: 0.125721 hartree
zpe.thermalcorrener: 0.136508 hartree
zpe.thermalcorrenthalpy: 0.137453 hartree
zpe.thermalcorrgfe: 0.087060 hartree
zpe.sumelectzpe: -623.653216 hartree
zpe.sumelectthermal: -623.642428 hartree
zpe.sumelectthermalent: -623.641484 hartree
zpe.sumelectthermalfe: -623.691877 hartree
dipole: 1.0244 -1.1156 5.0862
dipole: 5.3069
quadrupole: -48.0855 -52.1298 -22.6868
quadrupole: -0.2815 -10.5426 -0.0961
quadrupole: -7.1181 -11.1625 18.2806 -0.2815 -10.5426 -0.0961
hfenergy: -623.7789365 hartree
pointgroup: C01 [X(C5H7F3N1O1)]
dipole: 0.4056375 -0.4439791 2.0064342 debye
dipolederiv: 0.3704399 0.0285154 -0.3498329 0.0158979 0.2934831 -0.0102001 -0.2119867 -0.0245069 0.9684993 -0.1823678 -0.020377 0.4188205 -0.0178703 -0.0702186 0.0152286 0.1747691 -0.0035187 -0.9763784 0.6584584 0.067399 0.2505423 0.0422895 0.5195028 0.1181221 0.080567 0.074995 1.4852226 0.0341981 0.0084739 -0.0771448 0.0606093 0.0292109 0.0299364 0.0104296 0.0031513 -0.0692285 0.0582968 -0.0088369 -0.0556042 -0.0454353 -0.004845 -0.0648888 0.022483 -0.0049988 -0.0584223 -0.1728023 0.0122819 -0.0810097 0.0164628 -0.0609651 0.03791 -0.0545606 0.0277929 -0.3312994 0.1824425 0.0126494 -0.0332654 0.018379 0.1431959 -0.0533282 0.0041347 -0.0104976 0.0517158 0.1697549 -0.0152857 -0.0186514 -0.0265322 0.1395992 0.0697893 0.0070758 0.0216412 0.0596059 1.5495315 0.0051284 0.3229371 0.0310748 1.7230424 -0.0684857 -0.097519 -0.0039091 2.0574126 -0.3923357 0.004959 0.160124 -0.0029512 -0.2690126 0.0325452 0.2731197 0.0130587 -0.9874651 -0.5903585 -0.3175796 -0.1339768 -0.2767708 -0.5971959 -0.0216825 -0.041861 -0.0060023 -0.3871127 -0.4339223 0.2858804 -0.0818141 0.2339182 -0.7511026 0.0064967 -0.0046406 -0.0345859 -0.385284 -0.5540896 -0.0409842 -0.1508424 -0.0241096 -0.439996 -0.123888 0.0017875 -0.0777383 -1.43514 0.2423427 -0.0416429 -0.2783321 -0.0337957 0.3402097 0.0105147 -0.130814 0.0287091 1.0162142 0.0546188 -0.0522564 0.0781472 -0.0662598 -0.0835183 0.0546437 -0.0033438 -0.0361149 -0.0093678 0.0148212 -0.0245224 -0.0456928 -0.0188449 0.10727 -0.0179121 0.0060806 -0.0071066 0.0106135 -0.0090285 0.0961977 0.0755955 0.0939383 -0.0186598 -0.0148012 -0.0357212 0.0396307 -0.0095858 unknown
polarizability: 57.1226478|0.4294453|51.9567053|-8.2778891|0.2547009|93.0060768 unknown
InChI: InChI=1/5C.3F.N.O.7H
charge 1 multiplicity 1
17 atoms
C  0.43394781 -0.183067 0.05628126
N  -0.06772409 -0.20377196 1.08330488
C  -0.63576918 -0.20664036 2.42104188
H  -1.42809593 0.55575837 2.41324764
H  -1.07604214 -1.20418201 2.56275149
C  1.05249432 -0.1570413 -1.25926297
H  1.78968735 0.65245996 -1.28220505
H  1.55800537 -1.11314539 -1.42987707
C  -0.00962551 0.07319977 -2.35525573
F  0.58629258 0.0806802 -3.53730564
F  -0.92321702 -0.90105444 -2.32139878
F  -0.62822537 1.24040521 -2.1587495
O  0.41031482 0.07492128 3.26333381
C  0.01265527 0.12833776 4.64042107
H  -0.3835933 -0.83937584 4.96621261
H  0.91791667 0.36118934 5.19639493
H  -0.7314289 0.91677614 4.79676901
