program: Gaussian 09
title: opt freq
version: EM64L-G09RevD.01
method: RwB97XD
basis: 6-31+G(d,p)
operation: Freq
keyword: #P
keyword: Geom=AllCheck
keyword: Guess=TCheck
keyword: SCRF=Check
keyword: GenChk
keyword: RwB97XD/6-31+G(d,p)
keyword: Freq
converged: YES YES YES YES
title: Mulliken charges:
elementType: C N C H H C H H C H H F C H H F
charge: 0.492064 0.018535 -0.281431 0.249291 0.250486 -0.654001 0.279159 0.277530 0.069738 0.194547 0.193674 -0.261991 0.067441 0.189514 0.189182 -0.273739
chargesum: 1.00000
title: Mulliken charges with hydrogens summed into heavy atoms:
elementType: C N C C C F C F
charge: 0.492064 0.018535 0.218346 -0.097312 0.457959 -0.261991 0.446137 -0.273739
polarizability: 4.67750321e+01 -2.37184281e-01 5.05446260e+01 -1.23837238e-02 6.08099379e+00 9.04413755e+01
1716.lowfreq: -54.6235 0.0005 0.0009 0.0011 5.8891 10.4872 49.9540 63.2133 81.1442
frequency: 37.5064 60.0644 68.6397 98.7783 133.6047 240.8906 317.5575 338.2149 420.6514 494.3213 535.1992 792.8215 795.5516 807.5293 1012.0760 1046.2076 1087.4979 1092.7081 1133.3920 1139.2953 1139.6530 1242.2156 1261.7240 1302.0744 1316.1694 1316.5780 1344.0324 1440.3765 1442.8546 1451.4238 1477.8397 1523.3244 1536.1475 2505.3526 3079.8395 3093.0071 3103.3902 3112.0763 3138.9772 3159.7982 3174.6670 3183.6137
redmass: 3.0207 3.8936 3.7890 4.1194 4.6022 3.3063 8.4857 4.4733 4.2697 6.3998 6.8910 1.1990 1.1352 4.4170 4.5528 3.8932 3.9602 1.6437 6.5866 1.7940 6.5605 1.2016 1.1331 1.3977 1.0617 1.0594 1.2578 1.2051 1.2894 1.1204 1.0785 1.0864 1.0881 12.5411 1.0591 1.0568 1.0560 1.0575 1.1055 1.1130 1.1135 1.1105
irintensity: 3.9802 13.0962 9.1637 0.4211 1.3195 9.9347 4.1450 26.9035 11.9852 4.2200 0.4996 4.2127 0.2592 7.6647 72.0802 24.3280 44.5778 3.8518 1.3484 11.1307 167.9621 1.2097 3.1753 11.9378 1.5662 2.4829 2.8559 29.7104 20.9273 24.0471 13.6990 2.4924 2.1697 161.8794 28.5482 14.0806 6.2178 3.7073 19.0201 11.3959 2.0671 1.4587
temp: 298.150 k
press: 1.00000 atm
elementType: 6 7 6 1 1 6 1 1 6 1 1 9 6 1 1 9
symmnumber: 1
zpe: 340921.6 jmol-1
zpe.correction: 0.129850 hartree
zpe.thermalcorrener: 0.139074 hartree
zpe.thermalcorrenthalpy: 0.140018 hartree
zpe.thermalcorrgfe: 0.093692 hartree
zpe.sumelectzpe: -449.232108 hartree
zpe.sumelectthermal: -449.222884 hartree
zpe.sumelectthermalent: -449.221940 hartree
zpe.sumelectthermalfe: -449.268265 hartree
dipole: 0.8479 0.0498 -0.4765
dipole: 0.9739
quadrupole: -39.6655 -38.0658 -42.4679
quadrupole: -0.1174 0.0832 -0.9026
quadrupole: 0.4009 2.0006 -2.4015 -0.1174 0.0832 -0.9026
hfenergy: -449.3619578 hartree
pointgroup: C01 [X(C5H8F2N1)]
dipole: 0.3241366 0.0099799 -0.1833036 debye
dipolederiv: 0.2618316 0.0104429 -0.0879494 0.0349145 0.2970263 0.3614142 0.00624 0.1952173 1.1364579 -0.0957665 -0.0064112 0.0736085 -0.0280301 -0.1423348 -0.130702 0.0005824 -0.097384 -0.7494756 0.1454626 -0.0291032 0.0473457 -0.0332383 0.1046689 0.1956282 0.0007941 0.051222 0.3980647 0.1000326 0.0241887 -0.0305008 0.0087436 0.0995588 0.0345802 -0.023156 0.0285222 -0.0044718 0.0696896 -0.0081305 0.0580225 0.003458 0.1158734 0.0034152 0.0445623 -0.0034778 0.0129253 -0.0357953 0.0463383 -0.0807705 0.0486954 -0.1044138 0.056733 -0.0314116 -0.0250091 -0.4063262 0.1072111 -0.0090551 -0.089207 -0.0078121 0.1368466 0.0120824 -0.027332 -0.0025915 0.0595496 0.1239195 -0.0119872 0.0377261 -0.002672 0.1344781 0.0696063 0.0086509 0.0187337 0.0406946 0.4369953 -0.0353928 0.181733 -0.0532399 0.4951922 -0.1572851 0.0623763 0.0725664 1.3005215 0.0236312 -0.0646319 -0.0421542 -0.0240677 -0.020682 0.0008943 -0.0127025 -0.0090147 0.0054444 -0.0383549 0.0375277 0.0308678 0.0001996 0.0504394 0.0284418 0.0221695 -0.0074856 -0.0084043 -0.2436864 0.0269403 0.0065037 0.0192315 -0.3252944 -0.2043764 -0.0150895 -0.1385663 -0.9788441 0.4157733 0.0071145 -0.1224515 0.0197611 0.4453832 -0.1062175 -0.0459029 0.0803303 1.1621505 0.0117032 0.0730711 0.0427066 0.0330625 -0.0151146 -0.0064982 0.0147046 -0.0109456 0.0078284 -0.0402167 -0.0467464 -0.0440612 -0.00851 0.0474235 0.0157831 -0.0255037 -0.0107688 -0.0047603 -0.2424302 -0.0141652 0.0185806 -0.010496 -0.3190509 -0.1734995 0.0210181 -0.1413484 -0.9713549 unknown
polarizability: 46.7750321|-0.2371843|50.544626|-0.0123837|6.0809938|90.4413755 unknown
InChI: InChI=1/5C.2F.N.8H
charge 1 multiplicity 1
16 atoms
C  0.28105634 -0.14492036 -0.53755391
N  0.26367916 0.21509623 0.55127304
C  0.25574007 0.64036287 1.9224313
H  -0.39660587 1.51448715 1.98893529
H  1.27820814 0.92926415 2.17796642
C  0.30758614 -0.57972718 -1.92060286
H  1.35298229 -0.78092011 -2.18290855
H  -0.24810894 -1.52233106 -1.98673941
C  -0.29360203 0.46325727 -2.89451689
H  0.26929455 1.39968505 -2.87023214
H  -1.34941313 0.64520069 -2.67910108
F  -0.18362091 -0.09017467 -4.14132363
C  -0.24235081 -0.48923702 2.83969792
H  0.41235942 -1.36334593 2.7852482
H  -1.27322384 -0.76750745 2.60416081
F  -0.19713236 0.02590189 4.108916
