program: Gaussian 09
title: opt freq
version: EM64L-G09RevD.01
method: RwB97XD
basis: 6-31+G(d,p)
operation: Freq
keyword: #P
keyword: Geom=AllCheck
keyword: Guess=TCheck
keyword: SCRF=Check
keyword: GenChk
keyword: RwB97XD/6-31+G(d,p)
keyword: Freq
converged: YES YES NO YES
title: Mulliken charges:
elementType: C C C C C C H H H H C H C C C C H C H C H H H C Cl
charge: -0.119494 -0.160394 -0.015608 -0.572084 -0.029252 -0.146931 0.225378 0.220033 0.220429 0.225315 0.213364 0.239942 0.665310 -0.426916 -0.073290 -0.335052 0.150735 -0.192858 0.169987 -0.145054 0.184495 0.188971 0.188549 -0.172426 0.496849
chargesum: 1.00000
title: Mulliken charges with hydrogens summed into heavy atoms:
elementType: C C C C C C C C C C C C C C Cl
charge: -0.119494 0.064984 0.204425 -0.572084 0.191177 0.078385 0.213364 0.665310 -0.276181 0.096697 -0.150557 -0.003887 0.043495 0.067517 0.496849
polarizability: 1.26752172e+02 1.62531160e+01 3.48301259e+02 -2.32692724e+00 2.24994250e+00 1.14820670e+02
1716.lowfreq: -12.4066 -7.6852 0.0033 0.0036 0.0044 4.0487 29.6906 31.4437 52.0986
frequency: 28.4591 30.0957 52.0982 93.4443 122.4305 223.5787 248.7701 275.5066 315.4256 385.1563 397.7268 410.4313 456.4514 489.8122 504.6588 512.0689 616.5260 634.3181 637.0042 693.9085 702.0909 733.6290 769.1194 805.7551 842.5415 846.4136 863.9576 870.4904 874.4231 961.2117 1014.9747 1018.7383 1022.6442 1022.7996 1024.2817 1041.8864 1064.3142 1125.3743 1128.6908 1154.3998 1163.5030 1200.6676 1202.4714 1227.2606 1231.2855 1326.3877 1336.2576 1361.4578 1373.8293 1385.5610 1486.4454 1504.2947 1520.4980 1551.1952 1566.4158 1659.9894 1663.0611 1678.7742 1964.2100 3137.5886 3206.1753 3223.8664 3238.0290 3245.3135 3249.0111 3249.2358 3256.5254 3262.1441 3263.7805
redmass: 4.6183 6.7005 4.3119 7.2245 5.1982 6.1223 6.5801 3.7023 4.9517 6.2390 2.9690 2.8610 7.3551 4.4389 3.3326 3.1851 5.9118 6.2631 7.1531 5.8245 2.1460 5.0782 1.4148 5.7215 1.2873 4.0137 1.3934 1.6263 1.3269 1.3746 1.3709 1.3239 1.4046 4.6816 3.2671 1.3301 2.3040 1.6489 3.4043 1.3689 1.4446 1.8905 1.1835 1.2538 1.2308 1.3604 3.3894 4.4348 2.7807 1.6708 3.9744 2.2131 2.2868 2.2689 5.5278 5.5202 5.7697 5.4986 11.1090 1.0846 1.0910 1.0901 1.0906 1.0949 1.0914 1.0909 1.0989 1.0976 1.0989
irintensity: 0.0945 0.3777 0.0123 0.2811 0.5552 0.9396 2.5272 1.6436 4.9539 4.8908 0.2143 0.0006 24.4214 2.4534 14.0708 30.8431 1.4738 0.5521 4.1477 24.1232 27.2405 4.2188 39.1493 4.2825 3.1648 0.9567 10.6332 59.9349 11.9047 3.1151 0.5979 0.2377 0.8880 27.8064 7.9663 0.0742 4.9651 63.7614 387.5627 4.4196 4.4139 13.5914 0.5030 43.2613 1.6980 2.9006 154.1150 17.6042 12.3750 86.0516 78.6673 32.9516 0.2367 1.6278 1.7587 816.2445 36.7789 29.4948 472.6699 64.6894 5.6482 2.0065 0.1902 4.2017 3.3498 1.1162 3.1233 9.3214 0.3655
temp: 298.150 k
press: 1.00000 atm
elementType: 6 6 6 6 6 6 1 1 1 1 6 1 6 6 6 6 1 6 1 6 1 1 1 6 17
symmnumber: 1
zpe: 512903.9 jmol-1
zpe.correction: 0.195355 hartree
zpe.thermalcorrener: 0.207678 hartree
zpe.thermalcorrenthalpy: 0.208622 hartree
zpe.thermalcorrgfe: 0.154061 hartree
zpe.sumelectzpe: -999.017111 hartree
zpe.sumelectthermal: -999.004789 hartree
zpe.sumelectthermalent: -999.003845 hartree
zpe.sumelectthermalfe: -999.058406 hartree
dipole: 1.6210 -1.0434 -0.5175
dipole: 1.9960
quadrupole: -80.4231 -32.4061 -83.1229
quadrupole: 1.1301 -0.7284 0.9247
quadrupole: -15.1057 32.9113 -17.8055 1.1301 -0.7284 0.9247
hfenergy: -999.2124663 hartree
pointgroup: C01 [X(C14H10Cl1)]
dipole: 0.6289955 -0.4223305 -0.118046 debye
dipolederiv: 0.2328973 0.5557393 0.0800958 0.4178565 2.3304318 -0.0329698 0.0773603 -0.0562966 0.629106 -0.189778 -0.3745232 -0.1346045 -0.239801 -1.1395781 -0.4682451 -0.135146 -0.6473882 -0.186676 0.0757213 0.118209 0.0645203 0.2367667 1.0751146 0.2476498 -0.0808815 -0.8255022 0.0174547 -0.1088128 -0.5728621 0.019469 -0.3450169 -2.3975288 0.003078 0.0245775 0.0480132 0.0808804 0.0779054 0.3916783 -0.0690089 0.1475022 1.0521863 -0.2663283 0.0735163 0.7836014 0.0415129 -0.1080493 -0.1558448 0.1038474 -0.0872304 -1.1862101 0.4807356 0.1088728 0.694853 -0.2193454 0.1486022 -0.0237115 -0.0070106 -0.013018 0.0596915 0.0140575 -0.007749 -0.0015499 0.0889516 0.1239031 -0.0178046 -0.0114589 -0.0246685 0.0912016 -0.023566 -0.0037209 -0.0187191 0.0829372 0.1243002 -0.0113956 -0.0024314 -0.0156747 0.0892133 0.0296815 -0.0110333 0.0231381 0.084991 0.1465744 -0.0221394 -0.0135847 -0.0171381 0.0593744 -0.0110524 -0.0127729 0.0079331 0.0903631 0.1889347 0.791738 -0.0275149 0.530807 2.1813827 -0.0384776 -0.0315396 -0.0902135 -0.0826103 0.1524779 0.155335 0.0048275 -0.0538795 0.0228596 0.00623 0.0005404 -0.0323292 0.1571458 -0.083743 0.2402765 0.0167035 0.1205947 -0.0509966 -0.0213693 0.0131779 -0.0355707 -0.016363 -0.0109776 -0.3054943 -0.0220144 0.038338 -0.0235965 -0.0077215 -0.0158789 0.0531222 -0.0931652 0.0816187 0.2629786 -0.0265728 -0.1439612 0.1364659 0.0301016 -0.0332217 -0.0463546 -0.0920865 0.1241627 0.0249041 -0.0415223 0.0260055 -0.3681204 -0.0101609 -0.0408708 -0.0075073 -0.095936 0.0614031 -0.0759212 0.0086569 -0.0530939 -0.0589608 0.0079598 0.0096194 0.0138465 0.1165976 -0.1561317 0.1536137 0.0106612 0.1274132 0.0809139 -0.0208852 0.0091675 -0.0268593 -0.1121714 -0.0478991 0.0001046 0.0341144 0.0309886 0.1109868 -0.0053993 0.0343505 0.0002071 0.1337405 0.0631239 0.0348603 -0.0250754 -0.0584955 0.1093095 0.0127147 -0.0268892 -0.0055418 -0.0774356 -0.0248305 0.011005 0.0311371 -0.0194455 0.0543927 0.0024182 0.0302682 -0.0027153 0.1367082 0.0623115 -0.0318267 0.0149048 -0.039356 -0.0288028 0.0046312 0.0145708 0.0041333 0.1429502 0.0521422 0.0555239 0.0168059 0.0498147 0.005978 -0.0107701 0.0166628 -0.0114254 0.1366885 0.031521 -0.8564102 -0.021459 -0.364836 0.1195436 0.0650169 -0.0117885 0.1497419 0.0272708 -0.0173778 -0.3480327 -0.0034861 -0.2504718 -1.3252522 0.0126709 -0.0011924 0.029383 0.0084909 unknown
polarizability: 126.7521721|16.253116|348.3012593|-2.3269272|2.2499425|114.82067 unknown
InChI: InChI=1/14C.Cl.10H
charge 1 multiplicity 1
25 atoms
C  -0.07031726 -3.58841968 -0.11415658
C  0.29776377 -2.95481124 1.08949964
C  0.6346626 -1.62510736 1.06531513
C  0.60814591 -0.89902618 -0.17013366
C  0.2292296 -1.57337202 -1.37671835
C  -0.10565915 -2.90346923 -1.34522901
H  0.31092235 -3.52048663 2.01370603
H  0.92234911 -1.10907159 1.97511785
H  0.21144645 -1.01898205 -2.30901566
H  -0.39415146 -3.43125822 -2.24661455
C  0.93246758 0.41927472 -0.19492611
H  2.32690386 1.84564089 -0.39601787
C  0.39808562 2.85357882 -0.04565589
C  -0.97522987 2.72810862 0.20471681
C  0.98146896 4.12141686 -0.13642167
C  -1.75296525 3.86624377 0.36136308
H  -1.4355702 1.74655685 0.27961196
C  0.19477837 5.25807982 0.02126971
H  2.04545481 4.22188774 -0.3287325
C  -1.16916929 5.1312676 0.26913214
H  -2.81566122 3.76972866 0.55490663
H  0.64887612 6.24009606 -0.05073872
H  -1.78081086 6.01857182 0.39210595
C  1.26057868 1.67227219 -0.21951132
Cl -0.48877176 -5.2414411 -0.0800304
