program: Gaussian 09
title: opt freq
version: EM64L-G09RevD.01
method: RwB97XD
basis: 6-31+G(d,p)
operation: Freq
keyword: #P
keyword: Geom=AllCheck
keyword: Guess=TCheck
keyword: SCRF=Check
keyword: GenChk
keyword: RwB97XD/6-31+G(d,p)
keyword: Freq
converged: YES YES NO YES
title: Mulliken charges:
elementType: C N C H H C H H C F F F C H H H
charge: 0.421428 0.049687 -0.208586 0.236759 0.235016 -0.593950 0.294902 0.295058 0.860163 -0.257500 -0.248746 -0.249425 -0.458343 0.224099 0.198819 0.200621
chargesum: 1.00000
title: Mulliken charges with hydrogens summed into heavy atoms:
elementType: C N C C C F F F C
charge: 0.421428 0.049687 0.263188 -0.003990 0.860163 -0.257500 -0.248746 -0.249425 0.165196
polarizability: 5.35815185e+01 -8.49655717e-02 4.85639463e+01 -8.38420214e+00 9.17432351e-01 8.57572254e+01
1716.lowfreq: 0.0012 0.0013 0.0017 12.1361 17.5105 43.0562 52.0238 73.3634 86.6854
frequency: 51.9938 70.6039 83.2233 149.6673 192.0540 278.1916 302.0941 359.3798 422.4683 450.5872 508.7785 535.8519 544.9986 663.1652 757.0736 817.7299 855.5451 926.2788 974.1389 1072.6914 1128.1024 1171.9526 1173.3163 1229.3402 1266.7660 1319.2662 1324.5694 1377.4292 1384.7450 1446.4360 1454.3525 1498.3511 1501.8553 1518.5097 2528.0022 3095.2364 3096.5408 3113.3712 3162.1919 3172.8564 3193.1817 3197.1568
redmass: 5.2085 4.2109 3.8814 4.3354 1.9027 1.4086 9.8012 3.3555 3.8687 5.4451 6.3346 8.1269 8.3950 5.4009 4.7340 1.1284 6.7908 2.0264 2.3127 4.2335 1.9151 1.5758 1.6703 3.9286 9.7753 2.2303 1.0965 1.3310 1.9133 1.2028 1.0887 1.0638 1.0338 1.0561 12.5428 1.0359 1.0598 1.0585 1.1064 1.1089 1.1041 1.1065
irintensity: 2.5103 3.0125 4.0029 0.8520 2.9106 0.4345 1.2712 4.3457 2.8878 6.6906 13.9555 0.5784 0.6681 15.7108 1.8815 2.8869 6.9378 6.9527 1.2730 0.9791 13.0909 22.5394 94.6997 263.5497 225.1969 182.0968 1.1906 7.8717 162.3519 4.1085 20.8774 15.7349 18.9109 9.6289 85.3735 1.5621 31.3977 4.2126 24.5634 5.5142 0.9454 0.8000
temp: 298.150 k
press: 1.00000 atm
elementType: 6 7 6 1 1 6 1 1 6 9 9 9 6 1 1 1
symmnumber: 1
zpe: 319223.8 jmol-1
zpe.correction: 0.121586 hartree
zpe.thermalcorrener: 0.131029 hartree
zpe.thermalcorrenthalpy: 0.131973 hartree
zpe.thermalcorrgfe: 0.085893 hartree
zpe.sumelectzpe: -548.488170 hartree
zpe.sumelectthermal: -548.478727 hartree
zpe.sumelectthermalent: -548.477783 hartree
zpe.sumelectthermalfe: -548.523862 hartree
dipole: 2.2550 -0.7204 6.9013
dipole: 7.2961
quadrupole: -42.5814 -46.8787 -22.0146
quadrupole: -0.5012 -5.5150 0.2998
quadrupole: -5.4232 -9.7205 15.1437 -0.5012 -5.5150 0.2998
hfenergy: -548.6097556 hartree
pointgroup: C01 [X(C5H7F3N1)]
dipole: 0.886986 -0.3012165 2.7237676 debye
dipolederiv: 0.3066501 0.0118251 -0.2401375 0.0013266 0.2730176 0.0205547 -0.1741869 0.0017075 0.8074695 -0.1350008 -0.0129271 0.1345482 -0.0043619 -0.0725233 -0.0251669 0.0864408 -0.0136535 -0.582557 0.1910032 0.002592 -0.1369964 -0.0014884 0.159792 0.003324 -0.068086 0.0195506 0.548319 0.0941315 0.0121234 -0.0105445 0.0307798 0.0868767 0.0489609 -0.0152519 0.0337171 -0.0246017 0.1025979 -0.0097189 0.005027 -0.0266635 0.060053 -0.0610648 0.0025371 -0.0491303 -0.0083616 -0.1558973 0.0172092 -0.0952989 0.0255847 -0.0551845 0.0291402 -0.0588468 0.0193818 -0.2847279 0.1739529 0.0062805 -0.0328654 0.0088446 0.1340441 -0.0501181 -0.0009893 -0.0140767 0.0481804 0.1647501 -0.0134729 -0.0157422 -0.022224 0.1384478 0.0650606 0.0064266 0.0191079 0.0556969 1.5531142 0.019985 0.3146611 0.030342 1.7177414 -0.0667656 -0.0890756 0.0080484 2.0375925 -0.3888727 0.0127196 0.1531277 0.0081948 -0.2699821 0.0074848 0.2659036 -0.0159302 -0.9931255 -0.6099506 -0.3218575 -0.1199379 -0.2781056 -0.5821126 -0.0078855 -0.0325068 0.0040721 -0.3836257 -0.4228003 0.2744339 -0.0877956 0.226455 -0.7667893 0.0163864 -0.0135226 -0.0249468 -0.3831481 0.0058401 0.0044668 0.2125485 -0.0038259 0.0669111 0.026131 0.0485785 0.0013421 0.0008047 0.0490999 -0.0078815 0.0089224 -0.007252 0.1206433 -0.0082473 0.0309803 -0.0044605 0.002675 0.020983 0.045188 -0.0457724 0.0706039 0.0020608 -0.0209078 0.007892 -0.0479619 0.0850636 0.0503987 -0.0409655 -0.0437443 -0.0582102 -0.012996 0.0231135 0.0037071 0.0632323 0.074346 unknown
polarizability: 53.5815185|-0.0849656|48.5639463|-8.3842021|0.9174324|85.7572254 unknown
InChI: InChI=1/5C.3F.N.7H
charge 1 multiplicity 1
16 atoms
C  0.43352121 -0.14349141 0.57710312
N  -0.05785717 -0.11733166 1.6100188
C  -0.65802645 -0.08149096 2.92555707
H  -1.40061508 0.71935764 2.88897481
H  -1.17282356 -1.038307 3.04150195
C  1.03631785 -0.17845435 -0.74731096
H  1.79741027 0.60581502 -0.81135467
H  1.5108987 -1.1542398 -0.89333445
C  -0.03142124 0.04543472 -1.8377668
F  0.55095931 0.0014303 -3.02658051
F  -0.97002529 -0.90236775 -1.76554991
F  -0.61724971 1.23461658 -1.67168069
C  0.39905126 0.14821388 4.00089465
H  -0.10928762 0.16046929 4.96687327
H  1.13681789 -0.6559278 4.01234963
H  0.90099993 1.10794201 3.86629301
