program: Gaussian 09
title: opt freq
version: EM64L-G09RevD.01
method: RwB97XD
basis: 6-31+G(d,p)
operation: Freq
keyword: #P
keyword: Geom=AllCheck
keyword: Guess=TCheck
keyword: SCRF=Check
keyword: GenChk
keyword: RwB97XD/6-31+G(d,p)
keyword: Freq
converged: YES YES NO NO
title: Mulliken charges:
elementType: C C C C C C H H H H C H C C C C H C H C H H H C C H H H
charge: 0.272049 -0.198506 -0.038341 -0.406163 -0.016417 -0.197451 0.203329 0.214117 0.213443 0.203521 0.211741 0.237124 0.652826 -0.432488 -0.064468 -0.333843 0.150566 -0.190889 0.168795 -0.145990 0.182946 0.187240 0.186675 -0.161720 -0.526881 0.200567 0.228177 0.200041
chargesum: 1.00000
title: Mulliken charges with hydrogens summed into heavy atoms:
elementType: C C C C C C C C C C C C C C C
charge: 0.272049 0.004823 0.175776 -0.406163 0.197026 0.006070 0.211741 0.652826 -0.281922 0.104326 -0.150897 -0.003649 0.040684 0.075404 0.101904
polarizability: 1.29905412e+02 1.62945138e+01 3.26943944e+02 -2.60216348e+00 -4.96865232e+00 1.18208061e+02
1716.lowfreq: -16.6983 -0.9556 -0.0005 0.0006 0.0007 2.6826 30.5885 35.2584 54.1639
frequency: 30.2131 35.0332 54.0754 58.7167 101.7332 125.5944 227.7411 266.1879 275.8933 351.5614 394.0107 396.9020 410.5646 490.8512 494.6037 502.5778 508.4594 631.5973 643.8293 650.9337 702.8557 708.4713 742.9103 763.3381 824.2051 838.6875 845.8660 856.9437 863.0252 869.4352 957.7841 1009.5360 1021.0997 1024.2488 1025.7401 1027.8006 1034.3207 1041.8686 1053.8696 1064.7391 1126.1475 1161.2025 1166.2237 1198.1940 1203.2837 1226.1987 1230.7607 1259.9227 1333.6188 1338.3194 1374.5338 1379.5694 1387.3523 1416.7209 1473.7255 1496.5962 1497.9905 1506.8032 1535.1573 1552.4961 1579.3732 1664.0352 1674.2597 1680.5615 1968.2688 3059.8508 3145.0317 3145.6989 3188.7177 3204.3561 3220.9471 3235.1176 3238.8178 3240.3991 3241.7449 3253.7804 3254.0511 3255.6549
redmass: 3.8800 4.2116 4.1739 1.0372 4.4132 4.5729 4.1964 4.9618 3.0306 2.7326 3.0467 4.7059 2.8355 3.9434 3.5751 3.3768 4.1715 6.3789 6.8050 5.0947 2.1440 3.1079 4.2887 1.3855 4.5139 1.5687 2.5476 2.0461 1.2695 1.2902 1.3760 1.3766 1.3950 5.7461 1.9813 1.5936 1.4032 1.3314 1.7484 2.2729 1.5806 1.4364 1.3239 1.8160 1.1736 1.2571 1.2951 2.6896 1.5064 3.4138 2.4639 3.0126 1.8747 1.2119 1.1461 3.4887 1.1041 2.2726 2.3006 2.3385 4.3362 5.7681 5.4949 5.5054 11.1146 1.0445 1.0901 1.0852 1.1057 1.0910 1.0899 1.0909 1.0904 1.0901 1.0949 1.0973 1.0988 1.0987
irintensity: 0.0594 0.1182 0.0710 0.6244 0.4027 0.0337 0.2884 0.4333 4.6035 0.8515 0.3341 1.0588 0.0297 4.1512 8.0632 13.3983 33.3426 0.1392 3.6740 9.9791 27.6968 3.6486 6.0441 32.1580 21.9070 25.9031 13.8343 28.7501 0.9364 6.3167 2.1753 0.0922 1.0279 12.3406 1.1935 9.4990 0.4293 0.0247 58.3907 1.9866 10.4132 37.0288 3.8721 55.1199 1.5716 91.6284 19.6312 3.9765 1.1443 113.6897 8.1743 24.2030 82.3759 28.0824 4.1903 72.4319 15.3663 22.0717 5.2256 1.7429 0.3337 1.3135 593.8516 119.4861 458.1422 12.0309 19.9513 45.3497 1.6424 5.7236 2.0756 0.3160 0.1012 0.1752 4.9561 0.9799 3.7030 1.9791
temp: 298.150 k
press: 1.00000 atm
elementType: 6 6 6 6 6 6 1 1 1 1 6 1 6 6 6 6 1 6 1 6 1 1 1 6 6 1 1 1
symmnumber: 1
zpe: 610354.5 jmol-1
zpe.correction: 0.232472 hartree
zpe.thermalcorrener: 0.245505 hartree
zpe.thermalcorrenthalpy: 0.246449 hartree
zpe.thermalcorrgfe: 0.190631 hartree
zpe.sumelectzpe: -578.721194 hartree
zpe.sumelectthermal: -578.708161 hartree
zpe.sumelectthermalent: -578.707217 hartree
zpe.sumelectthermalfe: -578.763035 hartree
dipole: 0.9043 -5.1897 -0.1060
dipole: 5.2689
quadrupole: -75.2990 -13.1261 -79.0768
quadrupole: 3.5928 -0.7916 -1.2421
quadrupole: -19.4651 42.7079 -23.2428 3.5928 -0.7916 -1.2421
hfenergy: -578.9536662 hartree
pointgroup: C01 [X(C15H13)]
dipole: 0.3694398 -2.0388848 -0.0885581 debye
polarizability: 129.9054122|16.2945138|326.9439439|-2.6021635|-4.9686523|118.2080615 unknown
InChI: InChI=1/15C.13H
charge 1 multiplicity 1
28 atoms
C  -0.24653639 -4.02291166 0.12291028
C  0.28086394 -3.32953454 1.23586855
C  0.65311305 -2.01380336 1.12745726
C  0.50373456 -1.33254971 -0.12530007
C  -0.0326697 -2.04167315 -1.25021748
C  -0.39779133 -3.35682218 -1.11466159
H  0.38977842 -3.84841306 2.18230718
H  1.05931924 -1.47311347 1.97577229
H  -0.14443248 -1.52222652 -2.19612087
H  -0.80754706 -3.89660237 -1.96176584
C  0.85961342 -0.02938366 -0.23960267
H  2.26357222 1.3511782 -0.63364276
C  0.40743275 2.42056549 -0.11204701
C  -0.94879141 2.33925774 0.23160945
C  1.02224884 3.66948276 -0.24455894
C  -1.67742269 3.50133634 0.44055829
H  -1.43422143 1.3724416 0.33440772
C  0.28550736 4.83051619 -0.03255104
H  2.07320753 3.73605574 -0.50979835
C  -1.06154374 4.74730983 0.30882554
H  -2.72762101 3.4384189 0.70402069
H  0.76442404 5.79787284 -0.13600798
H  -1.63422174 5.65378173 0.47295046
C  1.21852724 1.21169811 -0.34131992
C  -0.61401406 -5.46507868 0.24518501
H  -1.41756092 -5.73761789 -0.4417982
H  0.26056958 -6.07558283 -0.01466471
H  -0.90294345 -5.72378943 1.26559576
