program: Gaussian 09
title: 000052726
version: EM64L-G09RevD.01
frameworkgroup: C1[X(C20H22F3NO2)]
method: RPBEPBE
basis: SDD
operation: Freq
keyword: #p
keyword: freq=noraman
keyword: PBEPBE/SDD
title: #p freq=noraman PBEPBE/SDD
converged: YES YES NO NO
title: Mulliken charges:
elementType: F F F O O N C C C C C C C C C C C C C C C C C C C C H H H H H H H H H H H H H H H H H H H H H H
charge: -0.166456 -0.166573 -0.169154 -0.260098 -0.242939 -0.339558 -0.042863 -0.580434 0.534641 -0.743746 -0.388840 -0.524156 -0.278539 -0.389879 0.294524 -0.211932 -0.366546 0.245502 -0.649536 0.289293 0.449041 -0.413687 -0.366537 -0.220935 -0.219313 -0.242038 0.209015 0.217499 0.233393 0.265135 0.215589 0.244856 0.222630 0.213027 0.217205 0.268655 0.221983 0.244620 0.240788 0.235890 0.265919 0.234987 0.244689 0.232192 0.259216 0.226544 0.227554 0.229371
chargesum: 0.00000
title: Mulliken charges with hydrogens summed into heavy atoms:
elementType: F F F O O N C C C C C C C C C C C C C C C C C C C C
charge: -0.166456 -0.166573 -0.169154 -0.260098 -0.242939 -0.074423 0.166152 -0.129541 0.534641 -0.060670 0.041392 -0.255500 0.188065 -0.149091 0.294524 0.023959 -0.100628 0.245502 -0.169860 0.289293 0.449041 -0.181495 -0.107321 0.005609 0.008240 -0.012667
polarizability: 3.05073423e+02 -8.17305877e+00 2.24127114e+02 2.15113802e+01 2.35908397e+00 1.59312425e+02
1716.lowfreq: -16.0283 -10.7671 -3.3909 -1.8509 -0.0008 -0.0007 0.0009 4.3750 13.7705
frequency: -14.4007 -6.7792 13.4151 14.1440 15.5235 23.4671 39.3732 55.9560 72.8743 85.4008 93.5771 119.1316 126.4761 148.9357 179.4931 186.5412 194.6634 220.3976 241.2578 263.1818 283.9997 304.1510 306.2190 328.3679 337.0911 374.4829 381.6674 403.1047 404.3805 428.9108 446.1654 466.8932 481.9799 488.3706 515.5707 520.9430 574.6445 606.3747 609.3330 613.6324 620.5734 638.3472 698.2736 699.4632 712.5181 713.8889 759.0991 799.6847 804.0684 819.8171 838.3557 851.1343 854.1346 859.5623 892.3668 918.7913 921.7563 931.1851 932.0779 941.7280 964.6785 977.5725 983.1481 988.8469 989.9198 992.1035 996.5803 1009.9321 1027.0342 1036.8783 1060.3357 1067.9450 1078.2788 1082.4581 1095.5046 1106.7690 1111.1614 1139.3785 1163.4065 1172.5173 1187.4267 1189.4724 1198.1637 1201.5319 1206.8380 1214.3628 1229.4079 1266.0402 1276.5595 1285.0645 1295.3656 1305.8332 1314.0952 1330.9320 1334.6957 1342.9689 1383.1627 1386.1877 1389.5855 1392.7907 1438.8141 1440.5493 1453.9866 1458.7394 1466.3918 1474.2315 1475.9936 1480.0602 1482.3915 1482.9449 1493.5877 1594.5250 1599.0666 1610.9215 1618.4194 1637.7171 2861.1366 2901.5944 2978.7458 2993.7703 3009.1922 3019.0635 3037.1743 3058.7874 3069.4942 3088.4154 3094.7727 3097.7096 3121.0033 3125.0364 3127.3210 3138.7723 3146.5561 3149.0964 3151.8968 3164.4461 3174.6886 3452.2020
redmass: 11.5587 5.7266 6.5173 5.3528 5.3406 5.0514 4.5669 4.6898 4.2122 4.0367 3.4672 3.4524 5.9312 4.1785 2.5157 3.6699 4.2505 1.4781 3.1835 3.9099 6.1304 6.1639 3.5332 6.7714 3.7580 3.2151 2.8570 2.8117 2.8165 4.8063 3.4266 3.3697 3.4612 3.1334 5.3268 8.9348 3.9834 3.2916 9.6993 2.2506 4.9936 5.2350 3.2848 3.8692 2.5824 2.0054 2.3988 1.4162 1.3772 3.8527 2.4201 2.9286 1.2793 3.2427 1.5443 1.5596 1.6000 2.1681 1.6230 1.8123 3.6555 1.3976 7.2351 4.6486 5.6870 1.5434 1.3418 6.1287 2.2339 2.2807 3.6479 2.0610 1.7289 1.7649 2.4496 1.7421 1.6692 2.9030 1.4889 1.0553 1.1098 1.1322 1.8223 2.7170 1.5255 1.5118 1.6154 1.1914 1.2352 1.5062 3.2275 1.3700 1.3453 1.3043 1.3500 1.3352 6.6420 1.3096 7.4536 1.4912 2.9500 2.0682 1.1388 1.2055 1.1461 1.0752 1.0814 1.5235 1.4211 2.1945 1.0846 6.1611 6.1417 6.1168 6.2624 9.9809 1.0823 1.0710 1.0367 1.0612 1.0606 1.0614 1.0868 1.1012 1.0995 1.1066 1.0983 1.1007 1.0854 1.0886 1.0874 1.0922 1.0922 1.0965 1.0920 1.1017 1.0976 1.0748
irintensity: 0.0168 0.0366 0.5008 0.7113 0.3593 0.3841 0.3372 1.3994 0.5170 0.1081 0.2927 1.7256 0.3748 0.1512 2.7417 3.5138 3.6517 2.0397 2.0736 3.0555 9.2377 0.4040 0.5038 3.0480 2.3409 8.9605 2.4550 0.5443 12.1960 1.3576 14.7022 7.7007 7.1983 7.0141 11.6788 0.9716 34.0697 44.5271 6.2424 55.1816 6.7711 0.0919 11.3226 8.8677 46.1935 39.7469 34.2100 31.8197 21.2545 8.9391 0.8157 8.2903 0.6654 23.3470 24.7795 4.5439 7.9552 28.8431 16.4312 2.3095 91.0943 0.2061 194.4863 12.3302 2.7846 6.1205 0.1996 155.2889 8.6692 55.4245 32.9632 119.9169 33.3817 1.3179 2.5366 251.0463 0.6088 54.2656 60.8073 0.6504 0.6511 2.2515 59.3522 1.6965 1.2588 69.7891 193.7370 1.0839 41.4190 55.0767 191.0219 15.7402 13.9619 5.5723 5.6394 60.2711 0.9702 24.7064 1.3243 5.5241 30.3672 8.8896 18.1633 15.1634 6.0041 6.2829 2.7359 12.6213 3.9436 21.3572 5.8825 3.5082 11.3419 17.8078 4.2394 171.7121 60.4921 78.3901 25.5716 24.1616 14.0877 11.8847 21.5311 12.5438 35.6851 31.2475 29.1295 6.4706 4.4516 11.8557 0.5488 19.2927 3.9253 32.1552 9.5045 20.4469 6.2612 0.4896
temp: 298.150 k
press: 1.00000 atm
elementType: 9 9 9 8 8 7 6 6 6 6 6 6 6 6 6 6 6 6 6 6 6 6 6 6 6 6 1 1 1 1 1 1 1 1 1 1 1 1 1 1 1 1 1 1 1 1 1 1
symmnumber: 1
zpe: 993624.6 jmol-1
zpe.correction: 0.378452 hartree
zpe.thermalcorrener: 0.402342 hartree
zpe.thermalcorrenthalpy: 0.403287 hartree
zpe.thermalcorrgfe: 0.320029 hartree
zpe.sumelectzpe: -1278.138137 hartree
zpe.sumelectthermal: -1278.114246 hartree
zpe.sumelectthermalent: -1278.113302 hartree
zpe.sumelectthermalfe: -1278.196560 hartree
dipole: 3.2466 3.4451 1.2394
dipole: 4.8933
quadrupole: -192.6802 -148.0494 -149.9935
quadrupole: -0.8304 3.4365 -3.4836
quadrupole: -29.1058 15.5250 13.5808 -0.8304 3.4365 -3.4836
hfenergy: -1278.5165887 hartree
pointgroup: C01 [X(C20H22F3N1O2)]
dipole: 1.3337089 -0.5779523 -1.2623602 debye
polarizability: 305.315681|20.7352318|188.4012711|-4.8165073|33.0826688|194.7960095 unknown
InChI: InChI=1S/C20H22F3NO2/c1-15(12-17-8-5-9-18(13-17)20(21,22)23)24-10-11-26-19(25)14-16-6-3-2-4-7-16/h2-9,13,15,24H,10-12,14H2,1H3
charge 0 multiplicity 1
48 atoms
F  -8.297879 -0.243146 -1.139999
F  -7.828235 -0.619457 1.043663
F  -7.347731 1.390353 0.122098
O  3.065307 -0.29672 0.91258
O  4.412737 0.851465 2.427667
N  -0.171867 1.414094 0.195797
C  -1.462942 1.078835 -0.451645
C  -2.296711 0.151181 0.493405
C  -3.527133 -0.437259 -0.173627
C  -2.22195 2.380185 -0.77314
C  0.900629 0.405195 0.093062
C  -4.824421 0.039291 0.129061
C  2.005033 0.737103 1.100302
C  -3.39925 -1.469436 -1.142254
C  -5.959438 -0.500577 -0.520879
C  -4.531779 -2.006368 -1.791111
C  -5.822953 -1.526239 -1.483578
C  -7.324048 -0.004232 -0.141313
C  5.263802 -1.1918 1.319773
C  4.241989 -0.107187 1.640649
C  6.33815 -0.680962 0.355789
C  6.479909 -1.255985 -0.930933
C  7.206387 0.373468 0.739635
C  7.477981 -0.79268 -1.819513
C  8.201715 0.837751 -0.148139
C  8.342637 0.255268 -1.429939
H  -1.298265 0.523619 -1.409139
H  -1.637409 -0.667587 0.840288
H  -2.570419 0.742647 1.385798
H  0.154209 2.353009 -0.06709
H  -1.664801 2.99463 -1.505327
H  -3.215236 2.16456 -1.201023
H  -2.361653 2.977039 0.147737
H  1.344519 0.323452 -0.927482
H  0.483882 -0.588376 0.339403
H  -4.950376 0.836647 0.869729
H  2.449012 1.735584 0.927399
H  1.631373 0.697157 2.137725
H  -2.402305 -1.860018 -1.381048
H  -4.412824 -2.801874 -2.534034
H  -6.706324 -1.934428 -1.983374
H  4.745579 -2.063771 0.890784
H  5.728948 -1.490866 2.276688
H  5.809228 -2.067483 -1.238206
H  7.091162 0.833547 1.727945
H  7.579235 -1.248891 -2.810776
H  8.867363 1.652134 0.159423
H  9.117259 0.614627 -2.116629
