program: Gaussian 09
title: 000052712
version: EM64L-G09RevD.01
frameworkgroup: C1[X(C14H17ClF3NO2)]
method: RPBEPBE
basis: SDD
operation: Freq
keyword: #p
keyword: freq=noraman
keyword: PBEPBE/SDD
title: #p freq=noraman PBEPBE/SDD
converged: YES YES NO NO
title: Mulliken charges:
elementType: Cl F F F O O N C C C C C C C C C C C C C C H H H H H H H H H H H H H H H H H
charge: -0.030201 -0.166225 -0.167297 -0.167382 -0.239703 -0.227500 -0.320536 -0.034150 -0.619894 0.529898 -0.696687 -0.358794 -0.539246 -0.387151 -0.315290 0.293615 -0.214273 -0.353264 0.244955 0.354161 -0.679649 0.207677 0.241370 0.202088 0.249560 0.217291 0.222286 0.236498 0.227711 0.225992 0.271010 0.242262 0.223756 0.250005 0.237318 0.265309 0.287351 0.287128
chargesum: 0.00000
title: Mulliken charges with hydrogens summed into heavy atoms:
elementType: Cl F F F O O N C C C C C C C C C C C C C C
charge: -0.030201 -0.166225 -0.167297 -0.167382 -0.239703 -0.227500 -0.070976 0.173527 -0.176437 0.529898 -0.020612 0.094909 -0.268236 -0.144889 0.158470 0.293615 0.023045 -0.087954 0.244955 0.354161 -0.105169
polarizability: 2.28631567e+02 2.81593277e+00 1.61186239e+02 1.36156828e+01 1.22860222e-01 1.35357255e+02
1716.lowfreq: -4.7598 -0.0006 0.0005 0.0015 2.6205 4.4058 8.7690 10.3741 15.9153
frequency: 8.7151 10.1343 15.9054 21.6214 33.5676 39.9518 46.9321 62.0260 86.6259 101.3838 124.4993 133.0835 152.5586 196.8377 215.2709 229.3860 259.7897 279.3235 297.6486 305.1201 327.0120 334.4373 372.7014 390.9104 419.2369 430.8120 447.6120 472.0666 498.4556 521.1043 565.5768 586.9966 608.5741 631.7045 656.3578 686.9158 700.8546 711.7539 741.7691 777.7007 804.8624 824.8297 839.5925 855.2915 894.4911 921.2315 923.8234 931.5572 941.1967 968.0016 983.1932 989.6113 990.7942 1013.9124 1036.4473 1057.8751 1061.5646 1078.3901 1096.0132 1103.7125 1112.4684 1153.8221 1159.7959 1187.2246 1200.4388 1211.3164 1217.9111 1230.2621 1264.8635 1276.0052 1282.8522 1296.2658 1309.4028 1317.5467 1337.8728 1343.3889 1383.1063 1389.1329 1391.4511 1431.7252 1440.2456 1453.1229 1464.4926 1471.0328 1476.6941 1481.9432 1484.3484 1496.0248 1599.1498 1619.8244 1639.6559 2853.8482 2908.0420 2966.3530 2989.6661 3024.0443 3048.4981 3064.0482 3086.2613 3088.2327 3093.3459 3125.7803 3130.3789 3150.2356 3151.9465 3172.5485 3183.3594 3413.2263
redmass: 14.2988 9.5866 6.3092 5.6554 6.2113 5.0665 4.7353 3.6615 3.8826 2.9875 5.3208 4.1557 3.7626 7.8252 5.5774 1.6963 2.3208 2.6552 5.4283 5.1369 3.7965 6.6353 2.8824 4.1976 2.9702 3.9855 3.9150 3.2774 3.7637 8.3924 6.8870 5.5134 11.6507 5.1416 5.4125 1.5795 3.1923 2.5937 7.1012 2.3108 1.6871 1.5037 2.2971 3.4630 1.4858 1.9266 1.7155 1.4122 2.0551 4.6663 8.2923 6.1659 1.3905 6.0666 2.3593 3.2373 2.4290 2.0857 1.8523 1.4956 1.6693 2.7380 2.0979 1.1013 1.8452 1.3178 1.4123 1.9782 1.2700 1.2744 1.1359 3.2493 1.2997 1.3150 1.3382 1.4505 1.3364 6.4060 1.2999 1.1083 2.9883 1.1030 1.1110 1.1919 1.2192 2.0704 1.0621 1.0679 6.1451 6.3059 9.6738 1.0816 1.0709 1.0644 1.0360 1.0635 1.0969 1.0878 1.0987 1.0559 1.0996 1.0888 1.1041 1.0920 1.0916 1.0984 1.1126 1.0737
irintensity: 0.4081 0.8597 1.0416 0.4073 0.5601 1.7877 1.2025 0.8907 0.0159 2.4171 0.7837 0.8784 1.3454 1.2697 1.7155 0.1334 4.9289 13.1914 6.7788 0.3140 2.9367 2.1311 2.9308 0.9700 3.1712 1.4690 10.4214 13.0639 13.3126 2.5890 26.3112 7.7627 17.5358 5.6442 23.6061 53.4125 20.7736 17.0342 1.2800 11.2456 53.5255 1.7574 3.8009 34.9662 9.2774 13.9110 13.5617 24.7110 1.1811 104.5038 191.9971 4.9665 3.9210 152.4642 96.7452 23.8591 10.6534 6.7729 51.6409 78.9832 1.2913 65.4701 27.9258 0.3219 80.1822 72.8526 1.0881 146.7040 23.3134 35.4171 32.0291 183.5989 3.7136 11.0142 20.9479 38.7236 9.6351 1.6722 14.8358 19.1315 26.8164 9.7546 19.1057 13.2030 18.0401 1.1821 5.7507 13.6362 6.8243 3.3921 171.7252 77.2380 69.3605 34.4952 14.9428 24.1619 14.7458 14.6298 40.8729 9.0013 27.9447 9.7524 12.3902 6.0447 5.3632 7.3417 1.7140 1.5649
temp: 298.150 k
press: 1.00000 atm
elementType: 17 9 9 9 8 8 7 6 6 6 6 6 6 6 6 6 6 6 6 6 6 1 1 1 1 1 1 1 1 1 1 1 1 1 1 1 1 1
symmnumber: 1
zpe: 761976.5 jmol-1
zpe.correction: 0.290222 hartree
zpe.thermalcorrener: 0.312392 hartree
zpe.thermalcorrenthalpy: 0.313336 hartree
zpe.thermalcorrgfe: 0.231246 hartree
zpe.sumelectzpe: -1506.876158 hartree
zpe.sumelectthermal: -1506.853988 hartree
zpe.sumelectthermalent: -1506.853044 hartree
zpe.sumelectthermalfe: -1506.935134 hartree
dipole: -2.8919 0.6217 -1.8329
dipole: 3.4798
quadrupole: -152.6271 -125.8287 -135.7709
quadrupole: 20.8783 -2.3601 0.8702
quadrupole: -14.5516 12.2469 2.3047 20.8783 -2.3601 0.8702
hfenergy: -1507.1663797 hartree
pointgroup: C01 [X(C14H17Cl1F3N1O2)]
dipole: 1.1706683 0.5040288 0.4998615 debye
polarizability: 229.8769095|1.7797328|156.909025|8.6169738|-9.7831748|138.3891263 unknown
InChI: InChI=1S/C14H17ClF3NO2/c1-10(19-5-6-21-13(20)9-15)7-11-3-2-4-12(8-11)14(16,17)18/h2-4,8,10,19H,5-7,9H2,1H3
charge 0 multiplicity 1
38 atoms
Cl 6.872751 0.085231 -2.402546
F  -6.683444 -0.022413 0.058222
F  -5.464553 -1.410975 -1.249591
F  -5.468047 -1.698014 0.996148
O  5.379878 -1.218823 0.317855
O  5.907135 0.980871 0.915341
N  1.75109 -0.478975 1.000425
C  0.491092 -0.181541 0.265595
C  -0.613035 0.077825 1.334718
C  -1.920075 0.582439 0.747812
C  0.106463 -1.345882 -0.669876
C  2.988687 -0.562351 0.197585
C  -3.055958 -0.256916 0.667087
C  -2.026154 1.909702 0.253666
C  4.104195 -1.133338 1.089556
C  -4.264004 0.220819 0.108157
C  -3.232549 2.385861 -0.303802
C  -4.361485 1.54301 -0.382736
C  -5.442192 -0.70161 -0.010423
C  6.161157 -0.068961 0.283309
C  7.363991 -0.280265 -0.616802
H  0.590011 0.746455 -0.353563
H  -0.768934 -0.861348 1.896615
H  -0.22475 0.827305 2.055902
H  1.872677 0.176245 1.787044
H  0.845458 -1.485588 -1.478245
H  0.042018 -2.286269 -0.093057
H  -0.869282 -1.151552 -1.148075
H  2.827315 -1.250384 -0.649127
H  3.315308 0.416956 -0.224771
H  -3.002981 -1.281358 1.050723
H  -1.158996 2.578431 0.31837
H  4.270507 -0.500278 1.980693
H  3.884825 -2.168797 1.386781
H  -3.297739 3.414708 -0.672449
H  -5.303458 1.907582 -0.803598
H  7.708228 -1.322364 -0.60515
H  8.15975 0.432565 -0.36859
