program: Gaussian 09
title: 000052690
version: EM64L-G09RevD.01
frameworkgroup: C1[X(C21H24N2)]
method: RPBEPBE
basis: SDD
operation: Freq
keyword: #pfreq=noraman
keyword: PBEPBE/SDD
title: #p freq=noraman PBEPBE/SDD
converged: YES YES NO NO
title: Mulliken charges:
elementType: N N C C C C C C C C C C C C C C C C C C C C C H H H H H H H H H H H H H H H H H H H H H H H H
charge: -0.085051 -0.107021 -0.284637 -0.284976 -0.559921 -0.503507 0.330783 0.332327 0.361497 0.357065 -0.083361 -0.433748 -0.432832 -0.403148 -0.403928 -0.463758 -0.462804 -0.252375 -0.252066 -0.249898 -0.249828 -0.624195 -0.624498 0.242659 0.241869 0.234619 0.234651 0.185285 0.223655 0.195409 0.232072 0.231437 0.197396 0.244358 0.244524 0.236559 0.236922 0.225232 0.225241 0.225397 0.225502 0.238703 0.188925 0.220663 0.220718 0.188914 0.239173
chargesum: 0.00000
title: Mulliken charges with hydrogens summed into heavy atoms:
elementType: N N C C C C C C C C C C C C C C C C C C C C C
charge: -0.085051 -0.107021 -0.041979 -0.043107 -0.090650 -0.318223 0.330783 0.332327 0.361497 0.357065 0.140293 -0.006266 -0.003999 -0.158790 -0.159404 -0.227199 -0.225882 -0.027143 -0.026825 -0.024500 -0.024326 0.024095 0.024306
polarizability: 2.26533699e+02 9.44794045e-01 2.54124965e+02 -1.91850869e+01 5.21267069e-01 2.08940480e+02
1716.lowfreq: -8.7583 -3.5132 -0.0008 -0.0006 0.0000 6.3909 25.6864 33.3352 46.5426
frequency: 25.2961 32.9770 46.5340 53.9723 90.1942 94.2461 107.6172 130.2164 182.4129 190.0937 195.3593 215.9183 233.6815 251.4325 262.7728 276.4527 310.6675 316.6552 333.2837 346.8136 367.8484 393.7596 438.5567 465.2976 467.3188 472.5250 511.3698 518.5947 518.8074 578.6248 628.2914 628.5986 652.9296 661.7354 697.9386 711.4275 750.5210 756.1846 763.1112 768.5342 802.7579 837.2212 853.5164 857.2045 874.2172 880.0462 888.5912 890.4107 918.9898 943.5952 945.1632 949.6553 955.5778 987.5436 987.9814 1005.6168 1014.1313 1035.6794 1038.5437 1042.3641 1054.0645 1058.6731 1064.0808 1071.5149 1088.4865 1090.9261 1093.9455 1100.5667 1110.4136 1120.6652 1128.5410 1149.7929 1158.9927 1169.2484 1171.8721 1174.1657 1191.2804 1201.4267 1205.9000 1211.2038 1245.6169 1251.9995 1255.0709 1259.0057 1260.5703 1275.3900 1282.2989 1331.1795 1337.9937 1350.2494 1360.4092 1377.6470 1382.8489 1387.4972 1416.9090 1437.5878 1437.6891 1442.9298 1457.7390 1460.0992 1461.8264 1471.2017 1472.9874 1476.9003 1484.8918 1487.5665 1494.4425 1584.7804 1586.2331 1608.1796 1612.8502 2823.7891 2848.0230 2855.9296 2875.7876 2924.9527 2937.9058 3021.7729 3023.3764 3055.1829 3059.3738 3078.6140 3082.4475 3083.9366 3089.2008 3100.6205 3112.3622 3113.3771 3120.6365 3121.0128 3136.9952 3137.2780 3158.2202 3158.5767 3196.7836
redmass: 3.9676 3.9194 4.5334 2.8913 4.2289 3.7729 3.4465 3.3864 2.9236 2.9204 2.5036 1.9918 1.0495 2.0681 3.9599 2.1976 4.9171 4.6059 3.1866 4.3692 2.6734 3.3625 3.3926 2.5461 2.9759 4.0566 3.4219 3.3619 3.7625 3.4140 4.5667 4.2233 3.7697 4.0390 3.6617 3.8655 3.2808 2.5187 1.3345 1.5840 2.9199 1.5365 3.1677 2.2698 3.4096 1.4684 1.3054 1.8254 4.6611 2.5635 5.0263 1.3975 1.5623 1.3263 1.3282 2.9075 1.8059 1.6509 2.6254 2.0837 1.2996 3.7202 2.3316 2.0259 1.8414 1.2941 1.2714 1.1478 1.7489 1.5873 1.5310 2.1847 1.9275 1.4092 1.0627 1.1636 2.8454 2.3993 2.4663 1.6323 1.4417 1.6736 1.3159 1.3344 1.3991 1.6607 1.9353 1.9048 1.4470 1.6068 1.7712 4.6076 3.1830 2.1370 1.1406 2.2430 2.0179 1.1801 1.0585 1.0657 1.5083 1.0496 1.0575 1.1203 1.0592 2.6906 3.2194 6.7551 7.1340 6.3714 6.4799 1.0813 1.0571 1.0643 1.0756 1.0645 1.0661 1.0718 1.0721 1.0964 1.1004 1.1011 1.1008 1.0855 1.0578 1.0878 1.0866 1.0863 1.0881 1.0883 1.0933 1.0934 1.1006 1.1006 1.1164
irintensity: 0.1817 0.1385 0.2576 0.1592 0.5786 0.1773 0.1178 1.5107 1.0645 0.0984 0.1055 0.4431 0.0776 2.6304 1.0444 4.2382 3.1991 1.0922 5.0176 0.0257 0.3319 1.1516 2.5110 2.4889 0.1767 3.1995 1.2405 9.5479 2.2287 2.3548 8.2052 7.9097 2.2360 2.8547 0.7488 12.3556 19.3924 7.7056 27.6458 76.0527 25.4947 17.3895 2.2372 1.8473 21.3709 0.0813 1.5687 2.7231 3.8972 22.7594 3.3396 0.7160 0.0147 0.3352 0.0192 4.8485 0.1223 3.3575 6.2687 23.4045 3.0197 19.8531 0.1400 10.7011 1.5313 4.2727 3.9096 4.0606 0.7349 8.1144 3.6133 37.0424 3.3121 7.3480 0.1974 3.6598 17.9938 14.0598 2.4681 0.1750 0.0571 0.0971 2.1240 6.3417 0.3064 13.1295 2.8219 0.0078 0.0818 57.5275 1.3844 2.0157 0.7148 10.6838 3.9940 2.9732 7.5521 9.7681 14.2416 3.6674 2.1391 3.6959 17.6966 13.1721 11.7508 30.4576 14.6060 1.5380 1.0145 1.8611 1.4710 56.9754 64.1884 101.7545 167.8018 62.9382 63.7207 26.9666 52.5069 36.6167 30.3444 15.6102 63.5108 2.4027 17.3958 17.4321 3.9648 12.1961 3.1670 3.4391 5.0650 51.9901 57.4374 20.1413 18.8090
temp: 298.150 k
press: 1.00000 atm
elementType: 7 7 6 6 6 6 6 6 6 6 6 6 6 6 6 6 6 6 6 6 6 6 6 1 1 1 1 1 1 1 1 1 1 1 1 1 1 1 1 1 1 1 1 1 1 1 1
symmnumber: 1
zpe: 1038609.1 jmol-1
zpe.correction: 0.395585 hartree
zpe.thermalcorrener: 0.415770 hartree
zpe.thermalcorrenthalpy: 0.416714 hartree
zpe.thermalcorrgfe: 0.346370 hartree
zpe.sumelectzpe: -922.383904 hartree
zpe.sumelectthermal: -922.363719 hartree
zpe.sumelectthermalent: -922.362775 hartree
zpe.sumelectthermalfe: -922.433119 hartree
dipole: 1.3690 0.0076 0.5915
dipole: 1.4914
quadrupole: -128.6217 -130.6064 -129.7385
quadrupole: -0.0573 -1.6024 0.1578
quadrupole: 1.0339 -0.9509 -0.0830 -0.0573 -1.6024 0.1578
hfenergy: -922.7794892 hartree
pointgroup: C01 [X(C21H24N2)]
dipole: 0.5293437 -0.0460235 -0.2488967 debye
polarizability: 227.6749908|1.1481644|254.105589|18.6321833|-0.5206416|207.8185644 unknown
InChI: InChI=1S/C21H24N2/c1-22(2)14-12-23(13-14)21-17-9-5-3-7-15(17)19-11-20(19)16-8-4-6-10-18(16)21/h3-10,14,19-21H,11-13H2,1-2H3
charge 0 multiplicity 1
47 atoms
N  1.145502 -0.034912 -0.371754
N  4.52224 -0.334523 -0.017734
C  -1.510701 0.918298 -1.719134
C  -1.611431 -0.602284 -1.73329
C  -2.825316 0.246051 -2.172006
C  0.11835 0.025637 0.702277
C  -1.442829 1.736232 -0.457746
C  -1.654125 -1.44408 -0.486558
C  -0.648935 1.353174 0.662038
C  -0.819766 -1.186125 0.639801
C  3.252924 -0.204184 -0.749041
C  2.296008 0.943924 -0.288412
C  2.114028 -1.196693 -0.344599
C  -2.151924 2.963134 -0.407668
C  -2.518687 -2.567824 -0.456298
C  -0.586944 2.208608 1.789105
C  -0.875096 -2.05912 1.753681
C  -2.083605 3.810312 0.719302
C  -2.565859 -3.433655 0.657393
C  -1.293105 3.431115 1.827402
C  -1.736586 -3.177966 1.77257
C  5.408954 0.826984 -0.239762
C  5.198002 -1.615147 -0.314161
H  -0.897273 1.332357 -2.529332
H  -1.057026 -1.078891 -2.551717
H  -3.675634 0.2954 -1.483587
H  -3.087679 0.273398 -3.234399
H  0.628936 -0.018184 1.700367
H  3.400662 -0.186659 -1.857271
H  2.535685 1.248436 0.755797
H  2.185479 1.834764 -0.928549
H  1.857839 -2.021452 -1.029989
H  2.295288 -1.591545 0.680558
H  -2.768168 3.247346 -1.269316
H  -3.164282 -2.755119 -1.322994
H  0.021994 1.907788 2.650783
H  -0.234799 -1.854523 2.620759
H  -2.641999 4.753183 0.734876
H  -3.243199 -4.295201 0.657412
H  -1.229711 4.076437 2.710648
H  -1.762178 -3.838954 2.646081
H  4.890145 1.755354 0.057304
H  5.734577 0.938311 -1.305794
H  6.314257 0.725801 0.385374
H  6.103678 -1.709051 0.311538
H  5.505357 -1.715327 -1.386637
H  4.52605 -2.45713 -0.071819
