program: Gaussian 09
title: 000052646
version: EM64L-G09RevD.01
frameworkgroup: C1[X(C13H12O5)]
method: RPBEPBE
basis: SDD
operation: Freq
keyword: #pfreq=noraman
keyword: PBEPBE/SDD
title: #p freq=noraman PBEPBE/SDD
converged: YES YES NO NO
title: Mulliken charges:
elementType: O O O O O C C C C C C C C C C C C C H H H H H H H H H H H H
charge: -0.211308 -0.287997 -0.215283 -0.433622 -0.258079 0.221795 0.427900 -0.433392 -0.099159 -0.507678 0.129488 -0.384070 0.204739 0.167970 -0.397350 0.187975 -0.760611 -0.517169 0.257354 0.247961 0.252098 0.329891 0.226982 0.240128 0.243415 0.282320 0.371177 0.235720 0.264048 0.214755
chargesum: 0.00000
title: Mulliken charges with hydrogens summed into heavy atoms:
elementType: O O O O O C C C C C C C C C C C C C
charge: -0.211308 -0.287997 -0.215283 -0.062444 -0.258079 0.221795 0.427900 0.071923 -0.099159 -0.255581 0.129488 -0.054179 0.204739 0.167970 -0.170368 0.187975 0.005252 0.197355
polarizability: 3.00135309e+02 -1.80665001e+00 1.63302029e+02 2.32148867e+00 -5.06913274e+00 7.97021722e+01
1716.lowfreq: -9.2383 -6.7794 -0.0006 0.0003 0.0003 5.7542 23.7588 46.8797 55.3388
frequency: 23.7148 46.8728 55.3001 70.8391 95.7590 117.4812 124.4838 130.2006 178.4044 204.2367 219.8956 228.0596 258.3604 274.8704 301.9968 315.7051 349.5508 378.7803 391.1220 398.7030 454.4553 468.3863 502.4643 564.2184 579.2046 595.8048 608.1083 622.0749 658.0924 701.3251 723.8872 731.4672 734.1041 813.0776 823.7097 884.1280 892.6192 929.5379 956.1153 982.9628 992.9528 1006.7309 1008.7237 1027.7049 1044.8879 1084.5533 1113.4912 1135.3322 1155.0189 1166.0371 1179.2679 1199.0846 1223.6400 1266.4604 1292.3949 1301.7213 1348.2159 1378.7256 1386.2958 1416.0930 1427.9297 1439.1968 1444.7592 1449.5699 1457.7518 1478.4210 1501.9314 1535.5935 1578.0261 1590.4016 1611.1175 1680.4983 2983.0027 2992.7645 3005.6541 3062.1370 3076.5276 3094.7757 3114.0607 3130.5446 3135.7213 3145.2742 3164.0069 3571.0296
redmass: 3.9562 4.7705 2.3025 3.8183 3.3296 2.7632 1.8645 1.6676 4.0211 4.3765 3.0267 4.0738 5.5146 6.3056 4.9531 4.8685 4.1693 4.1145 1.2477 6.3149 3.2600 5.4424 3.7506 5.7292 4.1080 4.5583 5.1905 7.0507 4.7650 6.7824 3.6369 6.7182 5.4847 6.7945 1.4227 1.6066 4.9349 7.2753 3.5327 1.8853 5.7118 1.3205 2.6242 2.0270 2.9795 2.3952 1.2381 4.0542 1.3834 1.1299 1.2852 2.1771 3.9940 2.6570 1.6498 1.4688 3.2791 1.2385 3.9620 3.2157 1.0872 1.2742 1.0838 1.1322 1.0585 1.0564 3.0155 6.9303 5.8699 8.0677 6.2695 12.1020 1.0347 1.0369 1.0574 1.1056 1.0946 1.0974 1.0902 1.1018 1.1052 1.0972 1.0905 1.0660
irintensity: 0.3814 2.8525 2.6278 8.8606 0.8758 2.7349 3.7495 1.6955 3.1571 7.5660 4.8960 3.9588 7.3025 3.7560 1.2195 6.8148 8.6707 7.4496 135.9247 2.2381 4.9998 1.6215 3.5338 26.9410 8.8028 17.0368 16.3133 4.7951 3.6280 0.8044 1.6379 7.0134 7.9128 23.2667 41.4827 23.4417 30.4457 114.3195 2.0181 3.6188 4.9900 14.7489 79.9909 21.1702 27.0204 146.1398 6.2600 139.0938 12.8625 2.2936 49.7689 10.6848 315.4458 141.8486 145.4105 37.1990 47.4212 67.2954 80.9557 26.4276 49.0302 0.4611 18.2006 32.2794 18.6300 48.6324 164.0643 387.2458 11.3548 128.9489 159.2062 468.7739 85.6691 3.9420 18.1464 5.8531 6.9951 35.7324 14.8220 16.2711 13.2934 67.3390 3.2709 87.2860
temp: 298.150 k
press: 1.00000 atm
elementType: 8 8 8 8 8 6 6 6 6 6 6 6 6 6 6 6 6 6 1 1 1 1 1 1 1 1 1 1 1 1
symmnumber: 1
zpe: 584902.8 jmol-1
zpe.correction: 0.222778 hartree
zpe.thermalcorrener: 0.239982 hartree
zpe.thermalcorrenthalpy: 0.240926 hartree
zpe.thermalcorrgfe: 0.176702 hartree
zpe.sumelectzpe: -877.369062 hartree
zpe.sumelectthermal: -877.351858 hartree
zpe.sumelectthermalent: -877.350914 hartree
zpe.sumelectthermalfe: -877.415138 hartree
dipole: -6.8934 1.6443 -0.3237
dipole: 7.0942
quadrupole: -108.1417 -101.7828 -105.2360
quadrupole: 1.8165 9.7773 1.8993
quadrupole: -3.0882 3.2707 -0.1825 1.8165 9.7773 1.8993
hfenergy: -877.5918401 hartree
pointgroup: C01 [X(C13H12O5)]
dipole: -2.7720114 0.1412644 -0.2934907 debye
polarizability: 297.4648193|20.1263012|147.6409771|1.0839788|-35.0971488|98.033714 unknown
InChI: InChI=1S/C13H12O5/c1-7(14)12-9(6-18-13(12)16)8-3-4-10(15)11(5-8)17-2/h3-5,15H,6H2,1-2H3
charge 0 multiplicity 1
30 atoms
O  2.914257 -1.911337 0.842101
O  -3.515217 -1.567975 1.328835
O  4.670942 -0.486772 0.31479
O  -4.503401 0.646413 -0.257693
O  1.748476 2.212516 -1.270303
C  1.092502 -0.470469 0.210876
C  -0.32627 -0.140984 0.041248
C  1.449709 -1.837075 0.796385
C  2.291158 0.210217 -0.01524
C  -1.30269 -0.971584 0.676465
C  3.441933 -0.672486 0.37124
C  -0.800505 0.944747 -0.756482
C  -2.684063 -0.733418 0.571714
C  2.553975 1.600398 -0.501585
C  -2.177833 1.189296 -0.869756
C  -3.129197 0.382777 -0.202048
C  3.824912 2.289705 -0.03587
C  -4.760168 -2.084318 0.716675
H  1.080395 -2.665899 0.165746
H  1.074751 -1.970877 1.827307
H  -1.020646 -1.82461 1.300842
H  -0.076233 1.571944 -1.282761
H  -2.524097 2.031858 -1.483331
H  3.901579 2.279871 1.067204
H  3.820892 3.325907 -0.406104
H  4.715944 1.749677 -0.401902
H  -4.682129 1.466987 -0.782038
H  -5.171201 -2.773326 1.469424
H  -5.467948 -1.267875 0.506044
H  -4.530927 -2.637108 -0.214283
