program: Gaussian 09
title: 000052678
version: EM64L-G09RevD.01
frameworkgroup: C1[X(C20H22N2)]
method: RPBEPBE
basis: SDD
operation: Freq
keyword: #pfreq=noraman
keyword: PBEPBE/SDD
title: #p freq=noraman PBEPBE/SDD
converged: YES YES NO NO
title: Mulliken charges:
elementType: N N C C C C C C C C C C C C C C C C C C C C H H H H H H H H H H H H H H H H H H H H H H
charge: -0.075789 -0.298738 -0.284934 -0.284664 -0.558956 0.334236 0.332905 -0.497122 0.359413 0.359227 -0.426344 -0.412583 -0.132378 -0.402831 -0.402313 -0.462021 -0.462775 -0.251738 -0.252224 -0.249174 -0.249190 -0.636683 0.243482 0.242647 0.234555 0.235204 0.177972 0.176963 0.240339 0.232994 0.172022 0.239473 0.244648 0.244702 0.233912 0.234059 0.249875 0.225541 0.225520 0.225398 0.225276 0.222617 0.227651 0.199823
chargesum: 0.00000
title: Mulliken charges with hydrogens summed into heavy atoms:
elementType: N N C C C C C C C C C C C C C C C C C C C C
charge: -0.075789 -0.048863 -0.041451 -0.042017 -0.089197 0.334236 0.332905 -0.319151 0.359413 0.359227 -0.009043 -0.007567 0.107094 -0.158183 -0.157611 -0.228109 -0.228716 -0.026197 -0.026704 -0.023775 -0.023914 0.013408
polarizability: 2.13283962e+02 8.07026644e+00 2.40448547e+02 -1.82431106e+01 2.99686341e+00 2.03519676e+02
1716.lowfreq: -11.3653 -5.8581 -0.0007 0.0003 0.0004 9.3984 32.0504 37.2323 48.9130
frequency: 32.0031 37.1981 48.9006 69.9257 86.3054 97.3113 110.5028 131.7271 178.2303 183.4903 197.6714 232.2807 251.0726 273.4174 310.4135 312.5969 325.9515 342.0647 392.5514 428.0286 434.8492 444.3358 472.7874 508.5296 516.7373 518.5598 578.1971 601.3016 628.1725 645.4355 652.2038 698.0788 703.8785 711.6671 755.1013 755.6229 762.5168 768.1485 801.3290 838.2169 853.2264 857.2553 872.1328 880.6681 888.0678 918.4610 929.0418 944.2384 949.7037 954.4859 969.3092 986.9256 987.5973 1013.4733 1018.4477 1039.4639 1042.0793 1052.4653 1054.2319 1057.7633 1066.0640 1081.2744 1094.9744 1109.8836 1112.1819 1117.7013 1121.0801 1138.7093 1158.1105 1170.1484 1171.9560 1174.4056 1190.9506 1202.3292 1215.4055 1230.7157 1236.3836 1245.7998 1252.1690 1256.5847 1261.7248 1281.1114 1330.2964 1333.8657 1349.0223 1360.1862 1376.7365 1382.4758 1387.5792 1435.9104 1437.1255 1437.4755 1455.7667 1461.1598 1461.5045 1470.9456 1478.7176 1486.8054 1493.7203 1494.5868 1584.7020 1586.0770 1607.5740 1612.3951 2808.1517 2882.7445 2886.9759 2898.7924 3015.9634 3034.1086 3053.0924 3068.1488 3075.1433 3085.5948 3089.4055 3101.6921 3110.6714 3111.9006 3119.8474 3120.7947 3136.2267 3136.8050 3157.6078 3157.9943 3196.6673 3459.0994
redmass: 4.0379 4.0957 4.2955 2.6756 3.4572 3.7459 3.3057 3.3172 1.5720 2.5971 3.1039 2.3374 3.7981 3.2288 4.7785 4.5792 3.2772 4.4322 3.3572 2.2662 2.9635 3.3338 4.3598 3.3960 3.5070 3.6699 3.3885 2.0677 5.6613 4.0620 3.7745 3.6297 2.1840 3.7728 2.5034 2.6027 1.3666 1.5840 2.7010 1.6201 2.9998 2.1624 1.3820 1.5398 1.6123 4.7839 3.2256 4.9375 1.3982 1.4493 2.9372 1.3272 1.3282 1.8281 2.6161 2.5346 2.0942 1.6645 1.3256 3.7301 2.2674 1.1371 1.2693 1.7590 1.5490 1.3851 1.5426 3.0975 2.0995 1.5672 1.0637 1.2466 2.6860 2.2578 1.7030 1.3974 1.8038 1.4684 1.5244 1.3155 1.4212 1.4470 1.8416 1.4172 1.4421 1.7709 5.1176 3.1809 2.1292 1.1402 2.2949 1.9544 1.2063 1.0923 1.4867 1.1202 1.1160 2.6727 3.2127 1.0495 6.7550 7.1293 6.3669 6.4816 1.0811 1.0640 1.0578 1.0697 1.0766 1.0864 1.0936 1.0956 1.0997 1.0854 1.0570 1.0886 1.0867 1.0865 1.0879 1.0879 1.0932 1.0934 1.1006 1.1006 1.1164 1.0745
irintensity: 0.6277 0.2954 0.4369 1.0558 0.7525 0.0559 1.7680 2.6568 0.3865 1.5716 0.3284 1.2440 1.2303 2.7333 2.2522 0.4114 6.5541 0.4923 1.1940 4.1838 4.3803 1.1418 4.7512 0.4162 4.9821 3.5738 4.9969 101.5165 13.3622 13.4368 2.9206 2.0401 20.0487 13.6453 7.4228 17.2590 27.4303 74.5786 23.1747 17.8347 2.9702 2.4870 7.1800 0.6939 0.2809 5.0253 3.6967 2.7443 1.0284 3.6679 17.1224 0.3580 0.0731 0.1801 7.8943 6.2657 19.9534 4.9862 3.0104 16.3894 2.0359 0.6774 0.8306 0.4695 7.9323 10.7065 5.0101 2.5557 9.8214 36.8283 0.1605 20.4344 16.4826 6.5102 0.0119 13.0410 28.7106 10.4682 1.5244 0.0244 4.5135 1.8827 0.8962 6.3303 27.0886 1.3392 1.6025 0.7129 9.8416 2.1733 1.9569 8.5565 47.0359 3.2950 1.9363 4.4759 9.4078 30.8580 15.1573 21.4845 1.5983 0.9972 1.8015 1.4591 60.5767 7.8663 176.0650 97.0684 57.0198 7.9459 45.3249 37.5022 40.6365 2.2770 17.4228 17.0327 4.8491 13.0131 3.0021 3.2138 16.6057 40.4025 56.0875 21.2010 18.8227 0.8948
temp: 298.150 k
press: 1.00000 atm
elementType: 7 7 6 6 6 6 6 6 6 6 6 6 6 6 6 6 6 6 6 6 6 6 1 1 1 1 1 1 1 1 1 1 1 1 1 1 1 1 1 1 1 1 1 1
symmnumber: 1
zpe: 967348.7 jmol-1
zpe.correction: 0.368444 hartree
zpe.thermalcorrener: 0.387352 hartree
zpe.thermalcorrenthalpy: 0.388296 hartree
zpe.thermalcorrgfe: 0.320802 hartree
zpe.sumelectzpe: -883.168367 hartree
zpe.sumelectthermal: -883.149458 hartree
zpe.sumelectthermalent: -883.148514 hartree
zpe.sumelectthermalfe: -883.216008 hartree
dipole: 0.9101 0.7611 -0.5445
dipole: 1.3054
quadrupole: -125.5438 -128.2249 -119.8487
quadrupole: 5.1790 -6.6542 1.5477
quadrupole: -1.0046 -3.6857 4.6904 5.1790 -6.6542 1.5477
hfenergy: -883.5368104 hartree
pointgroup: C01 [X(C20H22N2)]
dipole: 0.3418843 -0.3272437 0.1994589 debye
polarizability: 213.6297679|-5.8876213|241.5164445|17.9968571|1.9820357|202.1059731 unknown
InChI: InChI=1S/C20H22N2/c1-21-13-11-22(12-13)20-16-8-4-2-6-14(16)18-10-19(18)15-7-3-5-9-17(15)20/h2-9,13,18-21H,10-12H2,1H3
charge 0 multiplicity 1
44 atoms
N  1.376129 0.114172 -0.329412
N  4.797565 0.407034 -0.11993
C  -1.349895 0.731292 -1.730361
C  -1.272631 -0.790924 -1.726562
C  -2.569056 -0.094835 -2.195642
C  -1.400871 1.564013 -0.477845
C  -1.238069 -1.618506 -0.470245
C  0.331204 0.059966 0.725357
C  -0.588237 1.28609 0.659633
C  -0.45682 -1.254631 0.664655
C  2.377724 1.242886 -0.265765
C  2.485959 -0.907148 -0.274412
C  3.484941 0.24408 -0.724572
C  -2.250492 2.699039 -0.452269
C  -1.966795 -2.834551 -0.439393
C  -0.650089 2.150503 1.779622
C  -0.427994 -2.116835 1.787851
C  -2.303808 3.556737 0.66745
C  -1.930694 -3.68897 0.683519
C  -1.496307 3.281039 1.793698
C  -1.153833 -3.328098 1.807277
C  5.837496 -0.540489 -0.560311
H  -0.774384 1.205559 -2.535346
H  -0.65248 -1.208397 -2.529914
H  -3.431111 -0.136368 -1.52147
H  -2.814186 -0.110268 -3.262344
H  0.825351 0.087269 1.733731
H  2.570908 1.596883 0.776441
H  2.152677 2.110088 -0.90688
H  2.338583 -1.785259 -0.925431
H  2.720426 -1.246512 0.764301
H  3.598189 0.243851 -1.822897
H  -2.879391 2.902022 -1.327641
H  -2.572759 -3.104218 -1.312889
H  -0.027354 1.92998 2.655699
H  0.170027 -1.830036 2.66192
H  4.749717 0.504094 0.901958
H  -2.969026 4.427634 0.663369
H  -2.503686 -4.623153 0.684174
H  -1.527005 3.935689 2.671794
H  -1.116362 -3.978931 2.68798
H  6.798664 -0.288906 -0.077789
H  5.980083 -0.444819 -1.652788
H  5.611792 -1.612468 -0.344522
