program: Gaussian 09
title: 000052746
version: EM64L-G09RevD.01
frameworkgroup: C1[X(C22H28N2O2S)]
method: RPBEPBE
basis: SDD
operation: Freq
keyword: #p
keyword: freq=noraman
keyword: PBEPBE/SDD
title: #p freq=noraman PBEPBE/SDD
converged: YES YES NO NO
title: Mulliken charges:
elementType: S O O N N C C C C C C C C C C C C C C C C C C C C C C H H H H H H H H H H H H H H H H H H H H H H H H H H H H
charge: 0.834093 -0.552161 -0.533085 -0.086954 -0.183926 -0.363270 -0.357995 -0.346941 -0.398530 -0.391179 -0.398942 -0.448610 -0.370320 -0.458747 0.446016 -0.557586 -0.233071 0.484716 -0.244509 -0.334100 -0.220140 -0.404492 -0.228151 -0.222851 -0.261700 -0.216409 -0.240665 0.217018 0.175516 0.167927 0.209569 0.198238 0.197222 0.198099 0.193588 0.192666 0.201072 0.191372 0.213511 0.256956 0.227596 0.235543 0.200653 0.247209 0.233300 0.211573 0.291790 0.248618 0.294689 0.240997 0.301799 0.229656 0.238750 0.233298 0.241281
chargesum: 0.00000
title: Mulliken charges with hydrogens summed into heavy atoms:
elementType: S O O N N C C C C C C C C C C C C C C C C C C C C C C
charge: 0.834093 -0.552161 -0.533085 -0.086954 -0.183926 0.029264 0.019501 0.048519 -0.006842 0.002559 0.005941 0.035942 0.065876 0.021763 0.446016 -0.054222 -0.233071 0.484716 -0.244509 -0.085482 0.074548 -0.163495 0.073648 0.006805 -0.022950 0.016889 0.000616
polarizability: 3.59475897e+02 -1.42769893e+01 3.00841435e+02 8.75602480e+00 6.14272271e+00 1.90015913e+02
1716.lowfreq: -7.5103 -0.0006 0.0012 0.0015 3.7442 4.7052 17.3153 18.8153 26.9001
frequency: 16.6793 18.0604 26.7970 39.6899 47.9209 63.1440 79.6844 114.1792 119.8852 125.8022 161.8754 172.7719 183.4594 214.6149 219.6134 225.2257 237.5164 249.4410 259.9061 273.6203 276.9893 297.5182 314.8121 321.1024 350.0887 368.7774 385.0645 389.2891 406.3162 424.5877 432.1808 448.1228 469.7316 482.5491 496.8847 523.1521 528.8386 538.2734 552.8324 559.0476 584.0431 629.9469 646.8735 720.6576 727.2472 735.0036 736.4898 765.2952 768.3098 775.0589 782.3909 785.9600 804.6356 849.1760 851.1240 862.6286 865.2720 884.5788 895.2903 905.2788 912.9184 945.3250 948.1902 956.5667 959.5690 965.1101 978.9364 980.4756 984.7566 994.6825 999.4870 1012.5605 1019.5733 1037.4265 1040.9432 1052.3897 1060.1290 1084.8408 1101.8401 1113.2709 1119.2399 1122.6756 1128.5920 1147.4378 1151.5475 1157.5994 1168.8495 1171.3322 1190.6996 1198.6199 1212.5082 1230.6265 1240.5412 1251.0584 1264.0007 1267.9385 1274.6825 1275.6802 1285.6331 1297.8373 1307.0101 1317.9561 1330.1987 1340.5334 1342.1993 1350.0079 1354.7945 1357.4112 1368.5893 1370.4014 1378.9946 1384.6453 1392.4237 1425.2538 1428.9104 1451.9989 1452.4154 1454.1056 1459.2748 1461.4105 1462.4981 1468.0384 1470.4458 1475.9706 1481.9476 1485.2017 1497.3827 1551.1942 1569.4279 1600.5543 1608.3612 2816.3306 2825.2557 2850.7112 2954.0291 2965.6456 2968.5856 2982.5678 2983.8640 2994.7224 3007.2531 3007.5004 3020.0729 3027.5364 3031.3945 3036.3448 3043.3443 3044.3540 3053.0158 3063.2217 3073.2409 3126.2584 3129.1622 3141.0613 3141.9694 3150.5118 3151.6071 3168.4524 3169.7329
redmass: 4.8468 4.4432 4.6372 3.9055 3.6575 4.0568 4.2238 5.0234 4.3745 3.4684 2.7962 6.0505 5.3643 2.8122 3.2189 3.9946 3.1657 2.4306 6.1518 3.0897 6.9647 3.4269 2.0410 3.6589 4.4646 3.9271 4.4996 1.8641 2.8195 3.2620 4.6077 2.9062 4.3911 4.0340 4.2901 3.2745 4.8803 1.9059 3.5533 3.3165 3.4303 6.5517 6.8402 2.1499 3.8355 3.5130 3.6455 1.3875 1.6154 2.1847 4.3918 1.9998 1.4787 2.3703 1.6616 1.4582 1.7039 1.4592 2.4207 9.8352 2.3211 2.2724 2.4438 1.4969 1.2998 1.6461 2.7716 2.2378 1.6569 4.0578 1.5388 2.2599 3.0285 2.1818 1.9365 1.9766 1.7727 2.7036 1.9019 2.0701 2.0655 2.2313 1.6923 1.8084 1.2795 2.0225 1.0709 1.0680 1.2576 1.8295 1.7938 1.4282 1.4927 1.4650 1.2294 1.3290 1.4212 1.3893 1.2804 1.2223 1.3879 1.4060 1.2722 1.3822 1.4627 1.5287 1.3420 1.6169 2.8635 1.4259 5.3376 1.5826 1.4473 2.2381 2.4985 1.1018 1.2638 1.4490 1.0913 1.0913 1.6609 1.0881 1.0903 1.2026 1.2428 1.2478 1.2621 5.8516 5.8802 6.8485 7.1818 1.0717 1.0705 1.0699 1.0653 1.0649 1.0621 1.0615 1.0618 1.0823 1.0666 1.0624 1.0871 1.0931 1.0921 1.0909 1.1030 1.0989 1.1038 1.1018 1.1031 1.0871 1.0858 1.0886 1.0887 1.0938 1.0942 1.1004 1.0997
irintensity: 0.2858 0.9762 3.2741 0.3492 0.0618 0.6600 0.1253 0.6309 2.3157 3.3613 1.6894 2.2706 0.9640 0.0495 2.0216 0.5879 0.9466 0.8302 9.0496 1.6073 2.6971 0.5541 3.4059 0.2705 2.0081 1.4389 10.1600 4.2564 4.5133 5.9521 29.3540 0.5462 34.8592 27.5076 85.2353 12.6228 17.5360 0.5230 6.9969 0.4569 1.0279 2.3795 4.5132 5.9491 2.3952 7.9733 3.9959 57.7353 91.8941 14.0505 32.8265 17.4458 0.1051 1.4348 7.4261 1.3996 1.4052 1.2339 2.2473 69.2929 5.0561 32.3556 24.6948 4.7724 2.7369 4.7219 3.2353 10.9177 1.5190 0.3652 0.0911 1.9756 19.9725 19.3276 20.3385 10.0451 15.9846 0.2247 13.5266 18.9275 14.1793 6.4736 12.5225 4.1530 8.1303 38.5428 9.3132 2.5035 0.2354 24.8914 15.7371 24.6903 1.5153 19.9475 3.8627 51.2685 18.7175 10.2248 6.4181 10.3761 19.5182 2.3979 13.2827 10.5253 7.3552 2.6650 16.6987 12.8339 10.4745 7.0671 8.1009 0.1765 1.0047 3.4621 1.7642 1.7831 39.4490 43.2436 9.8261 14.1236 43.5817 2.5881 6.7123 28.3575 16.6801 6.3377 46.3215 5.5762 1.4650 47.2905 23.6087 41.3635 100.3159 179.7358 33.1793 48.8100 40.4773 28.4323 33.7749 9.5416 2.8647 38.5232 67.4299 9.0208 96.3042 17.2784 19.9088 20.6567 103.4615 39.6698 10.9027 3.3747 6.0454 7.7724 17.6102 1.9978 11.0450 42.8540 20.9778
temp: 298.150 k
press: 1.00000 atm
elementType: 16 8 8 7 7 6 6 6 6 6 6 6 6 6 6 6 6 6 6 6 6 6 6 6 6 6 6 1 1 1 1 1 1 1 1 1 1 1 1 1 1 1 1 1 1 1 1 1 1 1 1 1 1 1 1
symmnumber: 1
zpe: 1200002.2 jmol-1
zpe.correction: 0.457057 hartree
zpe.thermalcorrener: 0.482174 hartree
zpe.thermalcorrenthalpy: 0.483119 hartree
zpe.thermalcorrgfe: 0.400603 hartree
zpe.sumelectzpe: -1510.945395 hartree
zpe.sumelectthermal: -1510.920277 hartree
zpe.sumelectthermalent: -1510.919333 hartree
zpe.sumelectthermalfe: -1511.001849 hartree
dipole: -2.2315 -2.2885 -5.1232
dipole: 6.0385
quadrupole: -150.5006 -155.8655 -181.9346
quadrupole: -10.0965 -15.5115 -1.6023
quadrupole: 12.2663 6.9014 -19.1677 -10.0965 -15.5115 -1.6023
hfenergy: -1511.4024518 hartree
pointgroup: C01 [X(C22H28N2O2S1)]
dipole: -0.8191645 0.7284565 2.1077193 debye
polarizability: 359.5197955|14.4139575|298.3800909|-10.9717501|15.7949525|192.433358 unknown
InChI: InChI=1S/C22H28N2O2S/c25-27(26)21-11-4-2-9-19(21)13-18-24(20-10-3-5-12-22(20)27)17-8-16-23-14-6-1-7-15-23/h2-5,9-12H,1,6-8,13-18H2
charge 0 multiplicity 1
55 atoms
S  2.535755 -0.643251 -1.254121
O  3.485396 -1.755888 -1.998777
O  1.605874 0.343898 -2.170834
N  -4.272198 0.911024 -0.28482
N  0.026234 0.258123 0.627772
C  -4.733466 -0.490379 -0.469047
C  -5.417933 1.857501 -0.340281
C  -3.207569 1.293475 -1.252727
C  -5.761946 -0.888644 0.610435
C  -6.463418 1.537794 0.746747
C  -6.964085 0.082291 0.61019
C  -1.859799 0.586579 -1.007198
C  -1.313798 0.855045 0.412327
C  1.034776 1.073496 1.327132
C  0.216751 -1.126198 0.470332
C  1.88501 2.057851 0.436626
C  1.391802 -1.683418 -0.114384
C  3.337736 1.628975 0.368043
C  3.759715 0.426685 -0.246409
C  -0.763045 -2.070007 0.911913
C  1.65213 -3.063519 -0.171993
C  4.357969 2.387571 1.002239
C  5.088179 -0.025302 -0.272626
C  -0.525922 -3.455765 0.84966
C  0.694218 -3.964222 0.339861
C  5.705593 1.962714 1.003491
C  6.076126 0.755193 0.368622
H  -3.859097 -1.164068 -0.419476
H  -5.194598 -0.624515 -1.484826
H  -5.917056 1.825309 -1.34641
H  -5.026643 2.883049 -0.201346
H  -3.529554 1.103204 -2.309384
H  -3.058569 2.388005 -1.159143
H  -5.268066 -0.862462 1.601678
H  -6.097637 -1.928131 0.429858
H  -7.306215 2.251331 0.667952
H  -5.996502 1.67654 1.741297
H  -7.524448 -0.026557 -0.341602
H  -7.665833 -0.167123 1.428492
H  -1.119383 0.939397 -1.749244
H  -1.954776 -0.502801 -1.172942
H  -2.05597 0.522646 1.168577
H  -1.204191 1.947423 0.548351
H  1.714623 0.391997 1.870464
H  0.508119 1.669397 2.099418
H  1.835457 3.077699 0.857029
H  1.441589 2.077318 -0.574684
H  -1.693893 -1.694226 1.350004
H  2.561368 -3.410236 -0.675739
H  4.080177 3.325644 1.497257
H  5.327829 -0.952046 -0.805157
H  -1.291573 -4.147304 1.219688
H  0.881107 -5.041779 0.305098
H  6.467118 2.576934 1.496558
H  7.120437 0.426732 0.362156
