program: Gaussian 09
title: 000052666
version: EM64L-G09RevD.01
frameworkgroup: C1[X(C16H32N2)]
method: RPBEPBE
basis: SDD
operation: Freq
keyword: #pfreq=noraman
keyword: PBEPBE/SDD
title: #p freq=noraman PBEPBE/SDD
converged: YES YES NO NO
title: Mulliken charges:
elementType: N N C C C C C C C C C C C C C C C C H H H H H H H H H H H H H H H H H H H H H H H H H H H H H H H H
charge: -0.075512 -0.047955 0.533876 0.052725 -0.536707 -0.533700 -0.519033 -0.511384 -0.520967 -0.513345 0.336408 -0.412218 -0.393562 -0.750311 -0.760590 -0.750075 -0.642781 -0.619969 0.167596 0.208505 0.194461 0.194125 0.201186 0.205131 0.210421 0.206562 0.211982 0.204311 0.209482 0.208282 0.194606 0.215980 0.196447 0.208170 0.199244 0.218160 0.206641 0.209567 0.218933 0.217954 0.207731 0.209317 0.206617 0.218178 0.204350 0.219605 0.240815 0.207906 0.228250 0.214582
chargesum: 0.00000
title: Mulliken charges with hydrogens summed into heavy atoms:
elementType: N N C C C C C C C C C C C C C C C C
charge: -0.075512 -0.047955 0.533876 0.220321 -0.133740 -0.138388 -0.103481 -0.092839 -0.107175 -0.110456 0.336408 0.000209 0.013853 -0.115943 -0.115972 -0.115963 0.021989 0.030769
polarizability: 2.33194217e+02 1.37361019e+00 1.66641405e+02 5.32086242e-01 -2.06479819e+00 1.55373153e+02
1716.lowfreq: -27.2886 -18.3347 -5.0825 -0.0003 0.0002 0.0006 13.3532 37.7869 45.5203
frequency: -27.0282 37.6962 44.5366 57.1275 138.8221 156.2354 162.3384 180.0743 196.7768 217.6256 229.5943 239.5550 253.7084 259.7099 270.8730 277.9896 302.4896 315.3820 327.7472 350.8876 355.7272 378.3894 399.4785 405.5505 426.3018 435.1905 450.0086 453.1964 462.4482 484.9302 499.8432 500.8389 556.3423 587.9033 690.4789 708.4241 746.3558 781.5239 802.7112 811.4544 843.9987 903.4532 915.9742 921.1192 922.9425 927.0598 934.3025 937.4077 942.0600 945.8803 985.6271 1004.8120 1009.9524 1012.3390 1024.4323 1033.8744 1051.3455 1053.4960 1063.5297 1070.3619 1095.9724 1102.0490 1111.4370 1139.8035 1142.9304 1150.7952 1165.4343 1171.2119 1193.5554 1196.8461 1209.3193 1214.4161 1231.3998 1239.7339 1252.8100 1263.6278 1270.0167 1276.8066 1298.5585 1303.8161 1316.2293 1329.2694 1331.0473 1334.3676 1341.7020 1348.5354 1356.4196 1366.0571 1373.1586 1373.8486 1374.5254 1400.3779 1402.3792 1430.2836 1443.8304 1453.7774 1456.9378 1460.2100 1461.3723 1467.1594 1468.7034 1469.3585 1471.8516 1474.1795 1479.8201 1481.1475 1482.9768 1485.8968 1489.8748 1495.4270 1499.1400 1503.8188 2880.5508 2894.4180 2903.6564 2913.3509 2914.0495 2946.0031 2955.7278 2966.1524 2966.2964 2968.7782 2973.7699 2978.9731 2979.5180 2983.6815 3007.9829 3022.7842 3026.2049 3037.4243 3038.5675 3044.2081 3050.6184 3054.7402 3055.6329 3057.0275 3059.8439 3061.7241 3064.9369 3068.7884 3074.7665 3075.6446 3096.2883 3102.4023
redmass: 2.6018 3.4478 2.8832 2.9365 2.8879 2.8779 2.1513 2.6572 1.4591 1.6439 1.6193 1.4721 1.2116 1.3322 1.9268 1.6382 1.4983 1.8730 2.2504 2.4179 2.3107 2.0507 1.9839 1.9145 2.9716 2.6253 2.8722 2.5934 2.3949 2.3119 3.0955 2.3083 2.6777 2.4826 3.1307 2.8662 2.7027 1.5043 1.5607 2.4269 4.4223 2.2919 1.9937 1.5933 1.7641 1.6744 1.4185 2.4515 2.2918 2.0651 1.8966 1.7037 1.6919 1.4868 1.6013 1.8593 1.7461 2.1223 2.2094 1.2919 1.9435 1.8540 3.1377 1.5258 1.5212 2.2039 2.0138 1.4696 1.4797 1.6756 1.6986 2.1509 2.0440 2.1370 1.9554 1.4743 1.2547 1.5380 1.4687 1.3829 1.3273 1.4823 1.4269 1.5002 1.3716 1.4915 1.5092 1.4602 1.3334 1.2266 1.2139 1.2077 1.1381 1.1505 1.0848 1.0821 1.0672 1.0727 1.0629 1.0479 1.0711 1.0719 1.0666 1.0730 1.0684 1.0722 1.0665 1.0535 1.0636 1.0827 1.0582 1.0464 1.0706 1.0526 1.0695 1.0514 1.0820 1.0611 1.0639 1.0577 1.0372 1.0353 1.0380 1.0607 1.0621 1.0629 1.0947 1.0967 1.0981 1.1007 1.0994 1.0995 1.0797 1.0851 1.0995 1.0847 1.0990 1.0860 1.0981 1.0993 1.0979 1.0975 1.0993 1.0993
irintensity: 1.2727 0.0404 0.0212 0.1564 0.4548 0.3075 0.7875 0.2014 0.3078 0.0076 1.0700 0.2600 0.1417 0.4507 0.9319 0.2152 0.9716 0.1814 0.1145 1.1004 7.8784 0.1876 1.0197 0.3216 0.1342 0.0362 0.0954 0.2343 0.3680 0.8217 0.2127 1.2309 0.8470 5.4372 0.1240 0.0163 2.6361 0.2522 0.2703 1.5069 31.8871 20.3917 2.7395 7.7244 6.6371 2.3079 0.0477 1.1707 3.7440 0.1125 1.1365 11.7395 0.7600 0.7377 2.2908 10.4679 2.4173 0.8616 1.2890 0.1152 0.0209 5.6889 12.9770 2.0864 0.0919 3.5510 0.5331 2.5170 13.0920 8.3655 0.7661 1.9868 9.5993 20.3024 1.3395 2.7361 3.1292 4.3091 1.3327 0.9435 0.2976 1.9931 0.3121 1.2626 3.1738 0.6256 1.9283 4.0791 2.7442 25.2339 24.3330 19.2805 0.5458 8.5627 4.5499 3.3929 12.3347 14.4271 3.3271 1.8822 5.1770 3.5153 7.6158 0.9380 11.9063 0.4348 2.7492 9.0409 5.5300 17.2230 37.0986 40.4366 67.1032 88.3380 71.7731 103.1825 23.0430 32.4150 31.2347 44.8672 37.4394 42.8963 9.6789 1.0308 32.8397 42.3540 45.5596 44.5223 42.9087 20.8212 89.0705 57.8472 5.2579 53.6882 2.9784 58.7414 36.9066 41.3157 99.6050 8.5229 73.3564 54.2988 39.9051 36.7284
temp: 298.150 k
press: 1.00000 atm
elementType: 7 7 6 6 6 6 6 6 6 6 6 6 6 6 6 6 6 6 1 1 1 1 1 1 1 1 1 1 1 1 1 1 1 1 1 1 1 1 1 1 1 1 1 1 1 1 1 1 1 1
symmnumber: 1
zpe: 1198293.1 jmol-1
zpe.correction: 0.456406 hartree
zpe.thermalcorrener: 0.475449 hartree
zpe.thermalcorrenthalpy: 0.476393 hartree
zpe.thermalcorrgfe: 0.411269 hartree
zpe.sumelectzpe: -736.859366 hartree
zpe.sumelectthermal: -736.840323 hartree
zpe.sumelectthermalent: -736.839379 hartree
zpe.sumelectthermalfe: -736.904502 hartree
dipole: -0.1250 0.0392 -0.1629
dipole: 0.2091
quadrupole: -111.6698 -113.0633 -117.8881
quadrupole: 0.9083 -1.0083 -2.8342
quadrupole: 2.5373 1.1437 -3.6810 0.9083 -1.0083 -2.8342
hfenergy: -737.3157713 hartree
pointgroup: C01 [X(C16H32N2)]
dipole: 0.0489222 -0.014225 -0.0645768 debye
polarizability: 233.2110287|0.796161|166.5093746|-0.6576392|2.3517822|155.4883712 unknown
InChI: InChI=1S/C16H32N2/c1-15(2,3)14-6-8-16(9-7-14)10-12-18(13-11-16)17(4)5/h14H,6-13H2,1-5H3
charge 0 multiplicity 1
50 atoms
N  -3.222249 0.035378 -0.255478
N  -4.446047 -0.64194 0.372932
C  -0.290252 0.81125 -0.119951
C  2.716674 0.275741 0.231754
C  0.33127 0.274895 1.203653
C  0.816337 1.592985 -0.883797
C  1.63402 -0.535644 0.995156
C  2.114813 0.782014 -1.107481
C  -0.86497 -0.3306 -1.006929
C  -1.474623 1.772029 0.174569
C  4.093969 -0.479791 0.07446
C  -2.140496 -0.982765 -0.435245
C  -2.729888 1.061872 0.719629
C  4.65063 -0.856824 1.476878
C  3.959761 -1.773753 -0.774518
C  5.131696 0.458041 -0.60626
C  -4.869961 -1.790254 -0.475218
C  -5.557484 0.35285 0.38971
H  2.936159 1.179395 0.848313
H  -0.40114 -0.344452 1.755935
H  0.555571 1.146637 1.854993
H  1.064996 2.506987 -0.301849
H  0.414913 1.9379 -1.858781
H  1.406124 -1.467582 0.439898
H  2.014051 -0.847088 1.985933
H  2.843222 1.420919 -1.640716
H  1.905312 -0.080546 -1.771174
H  -0.115929 -1.127976 -1.172002
H  -1.110166 0.090037 -2.003107
H  -1.752179 2.296049 -0.762553
H  -1.161552 2.546458 0.903805
H  -2.480054 -1.740727 -1.159797
H  -1.928157 -1.506706 0.529088
H  -2.533429 0.590369 1.711754
H  -3.514915 1.822181 0.865572
H  4.031418 -1.622419 1.977529
H  5.674454 -1.26673 1.386147
H  4.698899 0.0304 2.137592
H  3.594592 -1.556283 -1.794943
H  3.267376 -2.498896 -0.309102
H  4.94446 -2.269429 -0.871234
H  5.218807 1.417428 -0.060351
H  6.13057 -0.017905 -0.615968
H  4.863325 0.684053 -1.653635
H  -4.980203 -1.517087 -1.551686
H  -5.844957 -2.141963 -0.096743
H  -4.164202 -2.630938 -0.385919
H  -5.735294 0.807423 -0.612344
H  -5.357236 1.157288 1.114746
H  -6.473334 -0.164682 0.722837
