program: Gaussian 09
title: 000052621
version: EM64L-G09RevD.01
frameworkgroup: C1[X(C15H22N2)]
method: RPBEPBE
basis: SDD
operation: Freq
keyword: #pfreq=noraman
keyword: PBEPBE/SDD
title: #p freq=noraman PBEPBE/SDD
converged: NO YES NO NO
title: Mulliken charges:
elementType: N N C C C C C C C C C C C C C C C H H H H H H H H H H H H H H H H H H H H H H
charge: -0.080408 -0.047628 -0.103686 -0.101854 -0.478065 -0.389448 -0.395838 -0.410821 -0.405573 -0.473937 -0.614809 0.439957 -0.447609 -0.388714 -0.224515 -0.239146 -0.251403 0.195990 0.194833 0.212684 0.212498 0.179569 0.226863 0.206163 0.172212 0.215223 0.174979 0.172231 0.210891 0.189950 0.217087 0.220108 0.221800 0.184185 0.228837 0.312574 0.220637 0.221124 0.223062
chargesum: 0.00000
title: Mulliken charges with hydrogens summed into heavy atoms:
elementType: N N C C C C C C C C C C C C C C C
charge: -0.080408 -0.047628 0.092304 0.092979 -0.052883 0.016984 -0.017463 -0.020620 -0.022451 -0.066901 0.011284 0.439957 -0.218772 -0.076139 -0.003879 -0.018023 -0.028341
polarizability: 1.99938139e+02 -4.52715371e+00 1.72576381e+02 -9.93854275e+00 2.25822123e+00 1.24608404e+02
1716.lowfreq: -12.0229 -0.0007 -0.0001 0.0005 4.8919 17.1388 30.7136 48.5346 56.7722
frequency: 28.6561 48.2315 56.5621 112.5234 136.2373 146.0537 207.7569 234.6898 247.2564 282.7848 290.7401 302.5722 317.1029 352.0884 359.2674 395.6933 408.5289 411.4648 462.0933 482.7415 548.7780 594.9559 615.6120 662.2877 706.5146 714.8436 743.8920 787.2823 792.4162 817.0728 825.9343 865.9915 900.2945 917.8548 923.8366 926.0284 960.6021 970.2743 981.1044 984.9484 987.5668 996.3843 1001.1001 1024.2183 1030.0648 1060.4365 1067.4494 1081.6117 1093.8418 1110.2745 1119.1102 1132.7396 1133.5694 1151.1620 1164.4184 1168.7081 1179.7922 1188.5120 1203.8728 1208.6898 1255.9516 1271.0430 1277.1848 1286.0709 1296.5511 1310.0329 1328.1129 1332.3179 1336.7249 1344.3861 1354.4710 1358.4035 1374.1027 1376.8543 1383.0474 1394.9245 1430.9556 1440.0080 1454.4874 1456.4516 1461.8562 1465.4864 1470.7428 1476.0746 1480.6518 1481.8639 1483.7865 1592.7852 1613.0546 2777.9191 2781.2805 2790.2687 2797.0290 2823.6254 2832.2009 2968.6084 2981.0321 2990.2075 2991.6685 2995.4019 2999.6723 3005.5013 3007.7427 3017.8943 3032.3579 3068.1700 3104.7544 3106.7916 3122.7640 3135.3296 3155.5565
redmass: 4.1539 3.7563 3.6873 3.3026 2.3465 2.8416 3.8641 1.1805 2.6283 3.9408 2.6223 2.3901 2.2755 2.1288 2.0002 2.1401 2.8599 2.8492 3.0658 3.3501 2.9571 4.7608 6.3732 4.7790 3.1861 3.0472 1.4912 3.4505 3.8137 2.8368 3.1088 1.2558 1.4748 1.5493 1.8870 1.6153 1.8681 1.9580 2.3323 1.4650 4.1472 3.4913 1.7474 2.0047 1.4630 1.5954 1.9112 1.6459 1.2740 1.4226 1.3608 1.7150 1.5299 2.5788 1.9993 1.0575 1.1332 1.1874 2.2192 1.1812 1.3063 1.5134 2.1652 1.7949 1.7334 1.6852 1.3398 1.7462 1.5366 1.6106 1.4003 1.6291 1.4713 1.6293 2.2176 1.7881 1.1751 2.0948 1.1014 1.0708 1.0777 1.0974 1.1183 1.1586 1.3342 1.4052 1.0935 6.1667 5.9695 1.0717 1.0717 1.0710 1.0713 1.0702 1.0598 1.0616 1.0852 1.0857 1.0848 1.0860 1.0847 1.0845 1.0705 1.0860 1.1033 1.1011 1.0887 1.0880 1.0898 1.0950 1.1010
irintensity: 0.2924 0.4395 0.0238 1.6527 0.1211 0.8445 1.3797 0.7077 6.3089 4.8197 7.5532 3.3306 0.4822 0.1025 0.4735 0.3319 0.1943 0.3911 7.6000 1.4966 1.3042 1.4897 0.9406 1.1195 21.6409 12.7002 71.2326 11.5923 8.3249 1.8553 3.9110 0.1137 4.7327 1.0345 4.4827 2.0446 1.1440 0.3079 1.4348 0.3609 1.1133 27.6270 12.8203 11.0420 10.4925 7.7840 11.3316 11.9149 0.6023 5.2120 3.9473 23.9671 2.7356 46.7948 22.9581 0.4643 4.1140 1.9593 5.7894 4.5654 10.5034 6.5348 36.9319 15.9963 13.0779 19.4874 2.2054 2.2119 6.9420 0.5989 6.6719 3.3462 0.3440 3.7114 5.7330 0.3830 1.7195 17.0437 6.8620 34.8324 1.9520 1.2567 4.2395 18.6031 18.9496 7.8347 3.3800 0.8542 7.5084 12.3045 159.7785 102.4019 178.2159 278.6200 171.3642 27.8448 15.3801 10.1094 10.4632 83.9746 149.9389 59.8145 30.3444 28.3505 47.4665 33.5662 8.2717 9.6420 1.5374 39.6236 43.6398
temp: 298.150 k
press: 1.00000 atm
elementType: 7 7 6 6 6 6 6 6 6 6 6 6 6 6 6 6 6 1 1 1 1 1 1 1 1 1 1 1 1 1 1 1 1 1 1 1 1 1 1
symmnumber: 1
zpe: 895412.3 jmol-1
zpe.correction: 0.341045 hartree
zpe.thermalcorrener: 0.356216 hartree
zpe.thermalcorrenthalpy: 0.357160 hartree
zpe.thermalcorrgfe: 0.298465 hartree
zpe.sumelectzpe: -692.967336 hartree
zpe.sumelectthermal: -692.952165 hartree
zpe.sumelectthermalent: -692.951220 hartree
zpe.sumelectthermalfe: -693.009915 hartree
dipole: 1.6848 -0.4732 0.2392
dipole: 1.7662
quadrupole: -99.2736 -97.1541 -103.8241
quadrupole: 0.5393 -1.8420 0.9853
quadrupole: 0.8103 2.9299 -3.7402 0.5393 -1.8420 0.9853
hfenergy: -693.3083803 hartree
pointgroup: C01 [X(C15H22N2)]
dipole: -0.6660746 0.1815896 0.0790531 debye
polarizability: 199.8657935|-3.6060294|172.1250503|10.844457|-4.5410625|125.1320804 unknown
InChI: InChI=1S/C15H22N2/c1-16-8-14-7-15(9-16)12-17(11-14)10-13-5-3-2-4-6-13/h2-6,14-15H,7-12H2,1H3
charge 0 multiplicity 1
39 atoms
N  -0.411226 1.102686 -0.300872
N  -1.987962 -1.442259 -0.148402
C  -2.020961 0.45627 1.523053
C  -2.860973 0.855985 -0.776121
C  -3.158154 1.125683 0.717373
C  -0.675784 1.127136 1.148015
C  -1.524934 1.543569 -1.154096
C  -2.069553 -1.073266 1.281945
C  -2.898299 -0.673235 -1.026676
C  0.914198 1.604442 -0.68111
C  -2.112756 -2.89366 -0.356659
C  2.04437 0.648444 -0.290069
C  3.34743 1.136779 -0.027428
C  1.805666 -0.748623 -0.235488
C  4.403782 0.245563 0.272339
C  2.859813 -1.639097 0.067314
C  4.163023 -1.147144 0.319513
H  -2.176773 0.620085 2.608162
H  -3.651737 1.307755 -1.40819
H  -4.141583 0.702705 1.001976
H  -3.19058 2.214688 0.91794
H  -0.698944 2.180828 1.542602
H  0.15871 0.612497 1.660688
H  -1.266959 1.313156 -2.206909
H  -1.695099 2.654957 -1.095904
H  -1.231795 -1.568522 1.811843
H  -3.021216 -1.455041 1.747676
H  -3.966014 -1.004925 -0.89188
H  -2.624018 -0.892495 -2.077678
H  1.133389 2.62126 -0.259453
H  0.919498 1.72248 -1.784353
H  -1.355228 -3.425449 0.247923
H  -1.935783 -3.137403 -1.420255
H  -3.121249 -3.298303 -0.074831
H  3.537449 2.217898 -0.055844
H  0.78206 -1.101709 -0.420125
H  5.408449 0.635738 0.473319
H  2.66728 -2.717999 0.107224
H  4.979665 -1.839574 0.554835
